{"text_format":"1","workbook":"xlsx","n_sheets":3,"sheets":["Instructions for Use","Activity List","Calendar"],"not_rendered":{"charts":0,"images":7,"macros":1,"external_links":0,"defined_names":10,"comments":2,"pivot_tables":0},"unopened":[],"bounds":{"document_bytes":16777216,"sheet_cells":100000,"rows_first":2000,"rows_last":500,"rows_between":2000,"halvings":0,"cell_chars":16384,"cell_head_chars":4096},"cells_cut":0,"cells_raw":0,"read":"whole","date_system":"1900"}

{"sheet":"Instructions for Use","index":0,"n_rows":25,"n_cols":1,"rows_kept":25,"cut":false,"hidden":false,"merged":[]}
["  Instructions for Using \n  Annual Planning Calendar for Program Management:\n  A Customizable Roadmap for Program and Fiscal Leaders"]
["Head Start five-year grants require the development of data-informed goals and objectives as well as a mechanism for continuous improvement. Through the Head Start leadership model, the governing body, Policy Council, and program’s management team must collaborate to develop a system of planning and oversight that will achieve progress toward their goals and ensure quality services for children and families. \n\nThe following calendar outlines the requirements for programs in the area of planning, including the development and implementation of oversight systems, which are critical to planning for continuous improvement. Head Start programs operate with differing fiscal years and  program calendars. The attached calendar outlines the planning requirements so that programs can identify the required planning activity and determine how it fits into their operational calendar. The activity list includes the leadership and administrative functions and requirements of the grant development and oversight process. Additional program area activities can be added. Use this customizable roadmap to identify required planning activities and foster meaningful collaboration with program and fiscal leaders. This practical Microsoft Excel-based calendar is compliant, comprehensive, and customizable."]
["How to Use the Annual Planning Calendar for Program Management"]
["1) Start with the \"Activity List\" sheet at the bottom of the page. "]
["2) Select the month and year that you want to start planning."]
["3) In the date column, enter the date when the activity will be completed."]
["4) If the events are recurring, enter them manually in the calendar page."]
["5) Dates will be automatically populated into the calendar view."]
["6) When all the activities have been assigned a date, go to the \"Calendar\" sheet at the bottom of the page to view  the dates in a calendar view. "]
["7)  Cells may need to be adjusted in order to show all of the text. To do so, adjust the size of the row by dragging the boundary below the numbered row. You may also select the cell and find \"Wrap Text\" in the ribbon above. "]
["8) The calendar may be printed or kept for reference."]
["9) To access control boxes using a keyboard, navigate to the cell and press alt and the down arrow. Use the up and down arrows to navigate the menu, then press enter to make your selection."]
["Adding activites: "]
["1) Use the \"Additional Items\" box."]
["2) If you run out of rows, right-click an existing entry and select \"Insert.\""]
["3) Select \"Entire Row.\""]
["4) Add activity."]
["Note: Some timeframes or activities have notes with helpful information. They have an indicator in the top right corner of the cell. See the example below."]
["Example"]
["Hover your mouse over that cell to reveal the note, or right-click and select \"Show/Hide Notes.\"\nYou can show all the notes by navigating to the top of the page and selecting \"Review\" and \"Show All Notes.\" For screen reader users, select a cell with a note and press Shift and F2 for the notes window."]
["Program Planning Resources"]
["Foundations for Excellence: A Guide for Five-Year Planning and Continuous Improvement 2nd Edition"]
["Self-Assessment: Your Annual Journey"]
["Community Assessment: The Foundation for Program Planning "]
["End of Instructions for Use"]

{"sheet":"Activity List","index":1,"n_rows":145,"n_cols":14,"rows_kept":145,"cut":false,"hidden":false,"merged":[]}
[{"$f":"MONTH(DATEVALUE(B1&\"1\"))","v":12},{"$f":"E4","v":"December"},null,null,"Annual Planning Calendar for Program Management: A Customizable Roadmap for Program and Fiscal Leaders",null,null,null,null,"Start",null,"January",1,2017]
[null,null,"Program Name: Your Program Name Here",null,null,null,null,null,null,"Pending",null,"February",2,2018]
[null,{"$f":"E5","v":2022},null,"Set your calendar start below:",null,null,null,null,null,"Done",null,"March",3,2019]
[null,null,null,"Month","December","Enter Project Month start here",null,null,null,null,null,"April",4,2020]
[null,null,null,"Year",2022,"Enter Project Year here",null,null,null,null,null,"May",5,2021]
[null,null,"  Prior to the Five-Year Project Period",null,null,null,null,null,null,null,null,"June",6,2022]
[null,null,"Progress","Date to be completed","Activity","Citation",null,null,null,null,null,"July",7,2023]
[null,null,null,null,"Conduct a communitywide strategic planning and needs assessment to design a program that meets community needs.","1302.11(b) ",null,null,null,null,null,"August",8,2024]
[null,null,null,null,"Ensure appropriate governance structure (e.g., governing body, Tribal Council, Policy Council) and bylaws are in place.","Sec. 642(c) ",null,null,null,null,null,"September",9,2025]
[null,null,null,null,"Establish Policy Council selection procedures. ","Sec. 642(c)(1)(E)(iv)(VI)",null,null,null,null,null,"October",10,2026]
[null,null,null,null,"Develop strategic long-term goals to ensure responsive program services.","1302.102(a) ",null,null,null,null,null,"November",11,2027]
[null,null,null,null,null,null,null,null,null,null,null,"December",12,2028]
[null,null,"  Start of Project Period",null,null,null,null,null,null,null,null,"January",null,2029]
[null,null,"Progress","Date to be completed","Activity","Citation",null,null,null,null,null,"February",null,2030]
[null,null,null,null,"Complete Governance, Leadership, and Oversight Capacity Screener and training plan.",null,null,null,null,null,null,"March",null,2031]
[null,null,null,null,"Begin implementation of action plans for five-year goals and objectives.","1302.102(b)(2)",null,null,null,null,null,"April",null,2032]
[null,null,null,null,"Begin monitoring identified data for progress on goals and compliance with the Head Start Program Performance Standards (the Performance Standards). ","1302.102(b)",null,null,null,null,null,"May",null,2033]
[null,null,null,null,"Design and implement coordinated approaches.","1302.101(b)",null,null,null,null,null,"June",null,2034]
[null,null,null,null,"Begin implementation of the governing body/Tribal Council and Policy Council orientation and training plan.  ",1301.5,null,null,null,null,null,"July",null,2035]
[null,null,null,null,"Support the governing body/Tribal Council in establishing procedures and guidelines for accessing and collecting information. ","Sec. 642(c)(1)(E)(iv)(IV) ",null,null,null,null,null,"August",null,2036]
[null,null,null,null,null,null,null,null,null,null,null,"September",null,2037]
[null,null,"  Annually at the Beginning of the Program Year",null,null,null,null,null,null,null,null,"October",null,2038]
[null,null,"Progress","Date to be completed","Activity","Citation",null,null,null,null,null,"November",null,2039]
[null,null,null,null,"Establish the Policy Council.","1301.3(a)",null,null,null,null,null,"December",null,2040]
[null,null,null,null,"Begin or continue implementation of action plans for five-year goals and objectives, including any modified or added goals or objectives. ","1302.102(b)(1)",null,null,null,null,null,"January",null,2041]
[null,null,null,null,"Begin or continue monitoring identified data for progress on goals, including any modified or added goals or objectives, and compliance with the Performance Standards. ","1302.102(c)(1)",null,null,null,null,null,"February",null,2042]
[null,null,null,null,null,null,null,null,null,null,null,"March",null,2043]
[null,null,"  Monthly",null,null,null,null,null,null,null,null,"April",null,2044]
[null,null,"Progress","Date to be completed","Activity","Citation",null,null,null,null,null,"May",null,2045]
[null,null,null,null,"Provide monthly reports so that the governing body/Tribal council and the Policy Council have accurate and regular information about program planning, policies, and Head Start agency operations.","Sec. 642(d)(2), ",null,null,null,null,null,"June",null,2046]
[null,null,null,null,null,"1301.2(b)(2)",null,null,null,null,null,"July"]
[null,null,null,null,null,"1301.3(c)(2)",null,null,null,null,null,"August"]
[null,null,null,null,null,"1302.102(b)",null,null,null,null,null,"September"]
[null,null,null,null,"Report enrollment in the HSES","Sec.641A(h)(2)"]
[null,null,"  Quarterly"]
[null,null,"Progress","Date to be completed","Activity","Citation"]
[null,null,null,null,"Submit Federal Financial Report (SF-425) detailing cash transactions made for federal award(s) and separate reports detailing expenditures made for the same award(s).","ACF-PI-HS-17-04"]
[null,null,"  Semi-Annually "]
[null,null,"Progress","Date to be completed","Activity","Citation"]
[null,null,null,null,"Submit semiannual Federal Financial Report (SF-425). ","ACF-PI-HS-17-04"]
[null,null,"  Annually"]
[null,null,"Progress","Date to be completed","Activity","Citation"]
[null,null,null,null,"Conduct community assessment or community assessment update. ","1302.11(b)(1) and (2) "]
[null,null,null,null,"Develop/update selection criteria. ","1302.14(a)(1)",null,null,null,null,null,"May"]
[null,null,null,null,"Support the governing body/Tribal Council in establishing and approving procedures and criteria for recruitment, selection, and enrollment of children.","Sec. 642(c)(1)(E)(iv)(II)"]
[null,null,null,null,null,"Sec. 642(c)(2)(D)(ii)"]
[null,null,null,null,null,"1302.14(a)(1)"]
[null,null,null,null,"Submit selection criteria to governing body/Tribal Council and Policy Council for review and approval. ","Sec. 642(c)(1)(E)(iv)(II)",null,null,null,null,null,"June"]
[null,null,null,null,null,"Sec. 642(c)(2)(D)(ii)"]
[null,null,null,null,"Submit reports to the governing body/Tribal Council and Policy Council.","1301.2(b)(2)",null,null,null,null,null,"October"]
[null,null,null,null,null,"1301.3(c)(2)"]
[null,null,null,null,null,"Sec. 642(d)(2)"]
[null,null,null,null,"Publish and disseminate the annual report.","1302.102(d)(2)",null,null,null,null,null,"November"]
[null,null,null,null,null,"Sec. 644(a)(2)"]
[null,null,null,null,"Complete an audit and submit a copy of the audit management letter and of any audit findings as they relate to the Head Start program.","Sec. 647 (c)(1)-(3)"]
[null,null,null,null,null,"75.100(d) "]
[null,null,null,null,"In preparation for the grant application process, register (or renew registration) with System for Award Management (Sam). Allow at least two weeks for registration to be complete on Grants.gov.","https://www.acf.hhs.gov/grants/howto"]
[null,null,"  Annually at the End of the Program Year",null,null,null,null,null,null,null,null,"December"]
[null,null,"Progress","Date to be completed","Activity","Citation"]
[null,null,null,null,"Identify topics and data for self-assessment.","1302.102(b)(2)(i)",null,null,null,null,null,"January"]
[null,null,null,null,"Communicate and collaborate with the governing body/Tribal Council and the Policy Council to conduct annual self-assessment and Identify key findings. ","1302.102(b)(2)(ii)",null,null,null,null,null,"February"]
[null,null,null,null,"Involve program leadership in the process of developing program improvement plan.","1302.102(c )(2)(i - v)",null,null,null,null,null,"March"]
[null,null,null,null,"Revise objectives and/or create new goals as needed and plan for ongoing improvements.","1302.102(c)(2)(i–v)",null,null,null,null,null,"April"]
[null,null,null,null,"Update staff training and professional development system.","1302.102(c)(2)(i) and (v) "]
[null,null,null,null,null,1302.92,null,null,null,null,null,"August"]
[null,null,null,null,"Identify systems, policies, and procedures in need of updates. ","1302.102(c)(1) and (2) "]
[null,null,null,null,"Identify and address staffing needs for upcoming year.  ","1302.102(c)(2)"]
[null,null,null,null,"Identify and address facility needs for upcoming year.  ","1302.102(c) "]
[null,null,null,null,null,"1303.44(a)(1)"]
[null,null,null,null,"Complete training and technical assistance (TTA) plan for upcoming year.","Sec. 648(d)(1)",null,null,null,null,null,"September"]
[null,null,null,null,"Prepare and submit the Program Information Report (PIR).","1302.102(d)(1)"]
[null,null,"  Annually at the End of the Grant Year"]
[null,null,"Progress","Date to be completed","Activity","Citation"]
[null,null,null,null,"Inform the governing body/Tribal Council and the Policy Council of planning and budgeting process.",1301.0999999999999,null,null,null,null,null,"October"]
[null,null,null,null,"Ensure updated community assessment and self-assessment data are ready for use in planning. ","1302.11(b) ",null,null,null,null,null,"November"]
[null,null,null,null,"Begin engaging governing body/Tribal Council, Policy Council, and program leadership in planning and goal-setting process.","1302.102(a) and (c)",null,null,null,null,null,"December"]
[null,null,null,null,"Develop a budget that supports program goals and objectives. ","75.210(d)",null,null,null,null,null,"January"]
[null,null,null,null,null,75.301000000000002]
[null,null,null,null,"Submit a grant application to the governing body/Tribal Council and the Policy Council for approval.","Sec. 642(c)(1)(E)(iv)(III) "]
[null,null,null,null,null,"Sec. 642(c)(2)(D)(iii)",null,null,null,null,null,"February"]
[null,null,null,null,"Submit a funding application for the next year. ",75.206000000000003,null,null,null,null,null,"March"]
[null,null,null,null,"Electronically submit a Real Property Standard Forms (SF-429A, SF-429B, and SF-429C).","ACF-PI-HS-17-03"]
[null,null,null,null,"Submit Federal Financial Report (SF-425), Annual and Final. ","ACF-PI-HS-17-04"]
[null,null," At the End of the Five-Year Project Period "]
[null,null,"Progress","Date to be completed","Activity","Citation"]
[null,null,null,null,"Submit Tangible Personal Property Report (SF-428A, SF-428B, and SF-428S) within 90 days of the end of five year grant. ","ACF-PI-HS-17-04"]
[null,null,"Ongoing Activities"]
[null,null,null,null,"Activity","Citation"]
[null,null,null,null,"Design and implement coordinated approaches in the areas of training and professional development, the full and effective participation of children who are dual language learners and their families, the full and effective participation of children with disabilities, and the management of program data (listed as start of year activity). ","1302.101(b)"]
[null,null,null,null,"In collaboration with the governing body and Policy Council, use ongoing monitoring results, data on school readiness, and other information described in 1302.102 of the Performance Standards and in section 642(d)(2) of the Head Start Act for strategic direction, ongoing oversight, and continuous improvement.","1301.2(c)(2)"]
[null,null,null,null,null,"1301.3(c)(2)"]
[null,null,null,null,null,1302.1020000000001]
[null,null,null,null,"Provide TTA or orientation for the governing body and Policy Council. ",1301.5]
[null,null,"  Additional Items",null,null,null,null,null,null,null,null,"December"]
[null,null,"Progress","Date to be completed","Activity","Citation (if appropriate)",null,null,null,null,null,"January"]
[]
[]
[null,null,null,null,null,null,null,null,null,null,null,"February"]
[null,null,null,null,null,null,null,null,null,null,null,"March"]
[null,null,null,null,null,null,null,null,null,null,null,"April"]
[null,null,null,null,null,null,null,null,null,null,null,"May"]
[]
[null,null,null,null,null,null,null,null,null,null,null,"June"]
[null,null,null,null,null,null,null,null,null,null,null,"July"]
[null,null,null,null,null,null,null,null,null,null,null,"August"]
[null,null,null,null,null,null,null,null,null,null,null,"September"]
[null,null,null,null,null,null,null,null,null,null,null,"October"]
[null,null,null,null,null,null,null,null,null,null,null,"November"]
[null,null,null,null,null,null,null,null,null,null,null,"December"]
[null,null,null,null,null,null,null,null,null,null,null,"January"]
[null,null,null,null,null,null,null,null,null,null,null,"February"]
[null,null,null,null,null,null,null,null,null,null,null,"March"]
[null,null,null,null,null,null,null,null,null,null,null,"April"]
[null,null,null,null,null,null,null,null,null,null,null,"May"]
[null,null,null,null,null,null,null,null,null,null,null,"June"]
[null,null,null,null,null,null,null,null,null,null,null,"July"]
[null,null,null,null,null,null,null,null,null,null,null,"August"]
[null,null,null,null,null,null,null,null,null,null,null,"September"]
[null,null,null,null,null,null,null,null,null,null,null,"October"]
[null,null,null,null,null,null,null,null,null,null,null,"November"]
[null,null,null,null,null,null,null,null,null,null,null,"December"]
[null,null,null,null,null,null,null,null,null,null,null,"January"]
[null,null,null,null,null,null,null,null,null,null,null,"February"]
[null,null,null,null,null,null,null,null,null,null,null,"March"]
[]
[]
[]
[]
[]
[]
[]
[]
[]
[]
[]
[]
[]
[]
[null,null,null,null,null,null,null,null,null,null,null,"April"]
[null,null,null,null,null,null,null,null,null,null,null,"May"]
[null,null,null,null,null,null,null,null,null,null,null,"June"]
[null,null,null,null,null,null,null,null,null,null,null,"July"]
[null,null,null,null,null,null,null,null,null,null,null,"August"]
[null,null,null,null,null,null,null,null,null,null,null,"September"]
[null,null,null,null,null,null,null,null,null,null,null,"October"]

{"sheet":"Calendar","index":2,"n_rows":211,"n_cols":9,"rows_kept":211,"cut":false,"hidden":false,"merged":[]}
[null,null,null,"  Annual Planning Calendar for Program Management:"]
[2,{"$f":"INDEX('Activity List'!L:L,'Activity List'!A1)","v":"December"},null,"  A Customizable Roadmap for Program and Fiscal Leaders"]
[null,null,{"$f":"'Activity List'!C2","v":"Program Name: Your Program Name Here"}]
[2,{"$f":"'Activity List'!B3","v":2022}]
[null,null,{"$f":"DATEVALUE(\"1-\"&'Activity List'!B1&\"-\"&'Activity List'!B3)","v":"2022-12-01"}]
[null,null,"Sun","Mon","Tue","Wed","Thu","Fri","Sat"]
[null,null,{"$f":"IF(WEEKDAY($C$5)=COLUMNS($C$6:C6),$C$5,\"\")","v":""},{"$f":"IF(C7<>\"\",C7+1,IF(WEEKDAY($C$5)=COLUMNS($C$6:D6),$C$5,\"\"))","v":""},{"$f":"IF(D7<>\"\",D7+1,IF(WEEKDAY($C$5)=COLUMNS($C$6:E6),$C$5,\"\"))","v":""},{"$f":"IF(E7<>\"\",E7+1,IF(WEEKDAY($C$5)=COLUMNS($C$6:F6),$C$5,\"\"))","v":""},{"$f":"IF(F7<>\"\",F7+1,IF(WEEKDAY($C$5)=COLUMNS($C$6:G6),$C$5,\"\"))","v":"2022-12-01"},{"$f":"IF(G7<>\"\",G7+1,IF(WEEKDAY($C$5)=COLUMNS($C$6:H6),$C$5,\"\"))","v":"2022-12-02"},{"$f":"IF(H7<>\"\",H7+1,IF(WEEKDAY($C$5)=COLUMNS($C$6:I6),$C$5,\"\"))","v":"2022-12-03"}]
[null,null,{"$f":"IF(C$7<>\"\",myvlookup(C7,Activities,2),\"\")","v":""},{"$f":"IF(D$7<>\"\",myvlookup(D7,Activities,2),\"\")","v":""},{"$f":"IF(E$7<>\"\",myvlookup(E7,Activities,2),\"\")","v":""},{"$f":"IF(F$7<>\"\",myvlookup(F7,Activities,2),\"\")","v":""},{"$f":"IF(G$7<>\"\",myvlookup(G7,Activities,2),\"\")","v":{"$error":"#NAME?"}},{"$f":"IF(H$7<>\"\",myvlookup(H7,Activities,2),\"\")","v":{"$error":"#NAME?"}},{"$f":"IF(I$7<>\"\",myvlookup(I7,Activities,2),\"\")","v":{"$error":"#NAME?"}}]
[null,null,{"$f":"IF(I7<>\"\",I7+1,IF(WEEKDAY($C$5)=COLUMNS($C$6:I6),$C$5,\"\"))","v":"2022-12-04"},{"$f":"(C9+1)","v":"2022-12-05"},{"$f":"D9+1","v":"2022-12-06"},{"$f":"E9+1","v":"2022-12-07"},{"$f":"F9+1","v":"2022-12-08"},{"$f":"G9+1","v":"2022-12-09"},{"$f":"H9+1","v":"2022-12-10"}]
[null,null,{"$f":"myvlookup(C9,Activities,2)","v":{"$error":"#NAME?"}},{"$f":"myvlookup(D9,Activities,2)","v":{"$error":"#NAME?"}},{"$f":"myvlookup(E9,Activities,2)","v":{"$error":"#NAME?"}},{"$f":"myvlookup(F9,Activities,2)","v":{"$error":"#NAME?"}},{"$f":"myvlookup(G9,Activities,2)","v":{"$error":"#NAME?"}},{"$f":"myvlookup(H9,Activities,2)","v":{"$error":"#NAME?"}},{"$f":"myvlookup(I9,Activities,2)","v":{"$error":"#NAME?"}}]
[null,null,{"$f":"IF(I9<>\"\",I9+1,IF(WEEKDAY($C$5)=COLUMNS($C$6:I6),$C$5,\"\"))","v":"2022-12-11"},{"$f":"C11+1","v":"2022-12-12"},"2022-12-13","2022-12-14","2022-12-15","2022-12-16","2022-12-17"]
[null,null,{"$f":"myvlookup(C11,Activities,2)","v":{"$error":"#NAME?"}},{"$f":"myvlookup(D11,Activities,2)","v":{"$error":"#NAME?"}},{"$f":"myvlookup(E11,Activities,2)","v":{"$error":"#NAME?"}},{"$f":"myvlookup(F11,Activities,2)","v":{"$error":"#NAME?"}},{"$f":"myvlookup(G11,Activities,2)","v":{"$error":"#NAME?"}},{"$f":"myvlookup(H11,Activities,2)","v":{"$error":"#NAME?"}},{"$f":"myvlookup(I11,Activities,2)","v":{"$error":"#NAME?"}}]
[null,null,{"$f":"I11+1","v":"2022-12-18"},{"$f":"C13+1","v":"2022-12-19"},"2022-12-20","2022-12-21","2022-12-22","2022-12-23","2022-12-24"]
[null,null,{"$f":"myvlookup(C13,Activities,2)","v":{"$error":"#NAME?"}},{"$f":"myvlookup(D13,Activities,2)","v":{"$error":"#NAME?"}},{"$f":"myvlookup(E13,Activities,2)","v":{"$error":"#NAME?"}},{"$f":"myvlookup(F13,Activities,2)","v":{"$error":"#NAME?"}},{"$f":"myvlookup(G13,Activities,2)","v":{"$error":"#NAME?"}},{"$f":"myvlookup(H13,Activities,2)","v":{"$error":"#NAME?"}},{"$f":"myvlookup(I13,Activities,2)","v":{"$error":"#NAME?"}}]
[null,null,{"$f":"IF(I13<>\"\",I13+1,IF(WEEKDAY($C$5)=COLUMNS($C$6:I6),$C$5,\"\"))","v":"2022-12-25"},{"$f":"C15+1","v":"2022-12-26"},"2022-12-27","2022-12-28","2022-12-29","2022-12-30","2022-12-31"]
[null,null,{"$f":"myvlookup(C15,Activities,2)","v":{"$error":"#NAME?"}},{"$f":"myvlookup(D15,Activities,2)","v":{"$error":"#NAME?"}},{"$f":"myvlookup(E15,Activities,2)","v":{"$error":"#NAME?"}},{"$f":"myvlookup(F15,Activities,2)","v":{"$error":"#NAME?"}},{"$f":"myvlookup(G15,Activities,2)","v":{"$error":"#NAME?"}},{"$f":"myvlookup(H15,Activities,2)","v":{"$error":"#NAME?"}},{"$f":"myvlookup(I15,Activities,2)","v":{"$error":"#NAME?"}}]
[null,null,{"$f":"IF(I15<>\"\",I15+1,IF(WEEKDAY($C$5)=COLUMNS($C$5:I7),$C$5,\"\"))","v":"2023-01-01"},{"$f":"C17+1","v":"2023-01-02"},"2023-01-03","2023-01-04","2023-01-05","2023-01-06","2023-01-07"]
[null,null,{"$f":"myvlookup(C17,Activities,2)","v":{"$error":"#NAME?"}},{"$f":"myvlookup(D17,Activities,2)","v":{"$error":"#NAME?"}},{"$f":"myvlookup(E17,Activities,2)","v":{"$error":"#NAME?"}},{"$f":"myvlookup(F17,Activities,2)","v":{"$error":"#NAME?"}},{"$f":"myvlookup(G17,Activities,2)","v":{"$error":"#NAME?"}},{"$f":"myvlookup(H17,Activities,2)","v":{"$error":"#NAME?"}},{"$f":"myvlookup(I17,Activities,2)","v":{"$error":"#NAME?"}}]
[]
[2,{"$f":"INDEX('Activity List'!L:L,'Activity List'!$A$1+1)","v":"January"}]
[2,{"$f":"IF(B2=\"December\",B4+1,B4)","v":2023},{"$f":"DATEVALUE(\"1-\"&B20&\"-\"&B21)","v":"2023-01-01"}]
[null,null,"Sun","Mon","Tue","Wed","Thu","Fri","Sat"]
[null,null,{"$f":"IF(WEEKDAY($C$21)=COLUMNS($C$22:C22),$C$21,\"\")","v":"2023-01-01"},{"$f":"IF(C23<>\"\",C23+1,IF(WEEKDAY($C$21)=COLUMNS($C$22:D22),$C$21,\"\"))","v":"2023-01-02"},{"$f":"IF(D23<>\"\",D23+1,IF(WEEKDAY($C$21)=COLUMNS($C$22:E22),$C$21,\"\"))","v":"2023-01-03"},{"$f":"IF(E23<>\"\",E23+1,IF(WEEKDAY($C$21)=COLUMNS($C$22:F22),$C$21,\"\"))","v":"2023-01-04"},{"$f":"IF(F23<>\"\",F23+1,IF(WEEKDAY($C$21)=COLUMNS($C$22:G22),$C$21,\"\"))","v":"2023-01-05"},{"$f":"IF(G23<>\"\",G23+1,IF(WEEKDAY($C$21)=COLUMNS($C$22:H22),$C$21,\"\"))","v":"2023-01-06"},{"$f":"IF(H23<>\"\",H23+1,IF(WEEKDAY($C$21)=COLUMNS($C$22:I22),$C$21,\"\"))","v":"2023-01-07"}]
[null,null,{"$f":"IF(C$23<>\"\",myvlookup(C23,Activities,2),\"\")","v":{"$error":"#NAME?"}},{"$f":"IF(D$23<>\"\",myvlookup(D23,Activities,2),\"\")","v":{"$error":"#NAME?"}},{"$f":"IF(E$23<>\"\",myvlookup(E23,Activities,2),\"\")","v":{"$error":"#NAME?"}},{"$f":"IF(F$23<>\"\",myvlookup(F23,Activities,2),\"\")","v":{"$error":"#NAME?"}},{"$f":"IF(G$23<>\"\",myvlookup(G23,Activities,2),\"\")","v":{"$error":"#NAME?"}},{"$f":"IF(H$23<>\"\",myvlookup(H23,Activities,2),\"\")","v":{"$error":"#NAME?"}},{"$f":"IF(I$23<>\"\",myvlookup(I23,Activities,2),\"\")","v":{"$error":"#NAME?"}}]
[null,null,{"$f":"IF(I23<>\"\",I23+1,IF(WEEKDAY($C$5)=COLUMNS($C$6:I22),$C$5,\"\"))","v":"2023-01-08"},{"$f":"(C25+1)","v":"2023-01-09"},{"$f":"D25+1","v":"2023-01-10"},{"$f":"E25+1","v":"2023-01-11"},{"$f":"F25+1","v":"2023-01-12"},{"$f":"G25+1","v":"2023-01-13"},{"$f":"H25+1","v":"2023-01-14"}]
[null,null,{"$f":"myvlookup(C25,Activities,2)","v":{"$error":"#NAME?"}},{"$f":"myvlookup(D25,Activities,2)","v":{"$error":"#NAME?"}},{"$f":"myvlookup(E25,Activities,2)","v":{"$error":"#NAME?"}},{"$f":"myvlookup(F25,Activities,2)","v":{"$error":"#NAME?"}},{"$f":"myvlookup(G25,Activities,2)","v":{"$error":"#NAME?"}},{"$f":"myvlookup(H25,Activities,2)","v":{"$error":"#NAME?"}},{"$f":"myvlookup(I25,Activities,2)","v":{"$error":"#NAME?"}}]
[null,null,{"$f":"IF(I25<>\"\",I25+1,IF(WEEKDAY($C$5)=COLUMNS($C$6:I22),$C$5,\"\"))","v":"2023-01-15"},{"$f":"C27+1","v":"2023-01-16"},"2023-01-17","2023-01-18","2023-01-19","2023-01-20","2023-01-21"]
[null,null,{"$f":"myvlookup(C27,Activities,2)","v":{"$error":"#NAME?"}},{"$f":"myvlookup(D27,Activities,2)","v":{"$error":"#NAME?"}},{"$f":"myvlookup(E27,Activities,2)","v":{"$error":"#NAME?"}},{"$f":"myvlookup(F27,Activities,2)","v":{"$error":"#NAME?"}},{"$f":"myvlookup(G27,Activities,2)","v":{"$error":"#NAME?"}},{"$f":"myvlookup(H27,Activities,2)","v":{"$error":"#NAME?"}},{"$f":"myvlookup(I27,Activities,2)","v":{"$error":"#NAME?"}}]
[null,null,{"$f":"I27+1","v":"2023-01-22"},{"$f":"C29+1","v":"2023-01-23"},"2023-01-24","2023-01-25","2023-01-26","2023-01-27","2023-01-28"]
[null,null,{"$f":"myvlookup(C29,Activities,2)","v":{"$error":"#NAME?"}},{"$f":"myvlookup(D29,Activities,2)","v":{"$error":"#NAME?"}},{"$f":"myvlookup(E29,Activities,2)","v":{"$error":"#NAME?"}},{"$f":"myvlookup(F29,Activities,2)","v":{"$error":"#NAME?"}},{"$f":"myvlookup(G29,Activities,2)","v":{"$error":"#NAME?"}},{"$f":"myvlookup(H29,Activities,2)","v":{"$error":"#NAME?"}},{"$f":"myvlookup(I29,Activities,2)","v":{"$error":"#NAME?"}}]
[null,null,{"$f":"IF(I29<>\"\",I29+1,IF(WEEKDAY($C$5)=COLUMNS($C$6:I22),$C$5,\"\"))","v":"2023-01-29"},{"$f":"C31+1","v":"2023-01-30"},"2023-01-31","2023-02-01","2023-02-02","2023-02-03","2023-02-04"]
[null,null,{"$f":"IF(MONTH(C$31)=MONTH($C$21),myvlookup(C31,Activities,2),\"\")","v":{"$error":"#NAME?"}},{"$f":"IF(MONTH(D$31)=MONTH($C$21),myvlookup(D31,Activities,2),\"\")","v":{"$error":"#NAME?"}},{"$f":"IF(MONTH(E$31)=MONTH($C$21),myvlookup(E31,Activities,2),\"\")","v":{"$error":"#NAME?"}},{"$f":"IF(MONTH(F$31)=MONTH($C$21),myvlookup(F31,Activities,2),\"\")","v":""},{"$f":"IF(MONTH(G$31)=MONTH($C$21),myvlookup(G31,Activities,2),\"\")","v":""},{"$f":"IF(MONTH(H$31)=MONTH($C$21),myvlookup(H31,Activities,2),\"\")","v":""},{"$f":"IF(MONTH(I$31)=MONTH($C$21),myvlookup(I31,Activities,2),\"\")","v":""}]
[null,null,{"$f":"IF(I31<>\"\",I31+1,IF(WEEKDAY($C$5)=COLUMNS($C$5:I23),$C$5,\"\"))","v":"2023-02-05"},{"$f":"C33+1","v":"2023-02-06"},"2023-02-07","2023-02-08","2023-02-09","2023-02-10","2023-02-11"]
[null,null,{"$f":"IF(MONTH(C$33)=MONTH($C$21),myvlookup(C33,Activities,2),\"\")","v":""},{"$f":"IF(MONTH(D$33)=MONTH($C$21),myvlookup(D33,Activities,2),\"\")","v":""},{"$f":"IF(MONTH(E$33)=MONTH($C$21),myvlookup(E33,Activities,2),\"\")","v":""},{"$f":"IF(MONTH(F$33)=MONTH($C$21),myvlookup(F33,Activities,2),\"\")","v":""},{"$f":"IF(MONTH(G$33)=MONTH($C$21),myvlookup(G33,Activities,2),\"\")","v":""},{"$f":"IF(MONTH(H$33)=MONTH($C$21),myvlookup(H33,Activities,2),\"\")","v":""},{"$f":"IF(MONTH(I$33)=MONTH($C$21),myvlookup(I33,Activities,2),\"\")","v":""}]
[]
[]
[]
[2,{"$f":"INDEX('Activity List'!L:L,'Activity List'!$A$1+2)","v":"February"}]
[2,{"$f":"IF(B20=\"December\",B21+1,B21)","v":2023},{"$f":"DATEVALUE(\"1-\"&B38&\"-\"&B39)","v":"2023-02-01"}]
[null,null,"Sun","Mon","Tue","Wed","Thu","Fri","Sat"]
[null,null,{"$f":"IF(WEEKDAY($C$39)=COLUMNS($C$40:C40),$C$39,\"\")","v":""},{"$f":"IF(C41<>\"\",C41+1,IF(WEEKDAY($C$39)=COLUMNS($C$40:D40),$C$39,\"\"))","v":""},{"$f":"IF(D41<>\"\",D41+1,IF(WEEKDAY($C$39)=COLUMNS($C$40:E40),$C$39,\"\"))","v":""},{"$f":"IF(E41<>\"\",E41+1,IF(WEEKDAY($C$39)=COLUMNS($C$40:F40),$C$39,\"\"))","v":"2023-02-01"},{"$f":"IF(F41<>\"\",F41+1,IF(WEEKDAY($C$39)=COLUMNS($C$40:G40),$C$39,\"\"))","v":"2023-02-02"},{"$f":"IF(G41<>\"\",G41+1,IF(WEEKDAY($C$39)=COLUMNS($C$40:H40),$C$39,\"\"))","v":"2023-02-03"},{"$f":"IF(H41<>\"\",H41+1,IF(WEEKDAY($C$39)=COLUMNS($C$40:I40),$C$39,\"\"))","v":"2023-02-04"}]
[null,null,{"$f":"IF(C$41<>\"\",myvlookup(C41,Activities,2),\"\")","v":""},{"$f":"IF(D$41<>\"\",myvlookup(D41,Activities,2),\"\")","v":""},{"$f":"IF(E$41<>\"\",myvlookup(E41,Activities,2),\"\")","v":""},{"$f":"IF(F$41<>\"\",myvlookup(F41,Activities,2),\"\")","v":{"$error":"#NAME?"}},{"$f":"IF(G$41<>\"\",myvlookup(G41,Activities,2),\"\")","v":{"$error":"#NAME?"}},{"$f":"IF(H$41<>\"\",myvlookup(H41,Activities,2),\"\")","v":{"$error":"#NAME?"}},{"$f":"IF(I$41<>\"\",myvlookup(I41,Activities,2),\"\")","v":{"$error":"#NAME?"}}]
[null,null,{"$f":"IF(I41<>\"\",I41+1,IF(WEEKDAY($C$5)=COLUMNS($C$6:I40),$C$5,\"\"))","v":"2023-02-05"},{"$f":"C43+1","v":"2023-02-06"},"2023-02-07","2023-02-08","2023-02-09","2023-02-10","2023-02-11"]
[null,null,{"$f":"myvlookup(C43,Activities,2)","v":{"$error":"#NAME?"}},{"$f":"myvlookup(D43,Activities,2)","v":{"$error":"#NAME?"}},{"$f":"myvlookup(E43,Activities,2)","v":{"$error":"#NAME?"}},{"$f":"myvlookup(F43,Activities,2)","v":{"$error":"#NAME?"}},{"$f":"myvlookup(G43,Activities,2)","v":{"$error":"#NAME?"}},{"$f":"myvlookup(H43,Activities,2)","v":{"$error":"#NAME?"}},{"$f":"myvlookup(I43,Activities,2)","v":{"$error":"#NAME?"}}]
[null,null,{"$f":"IF(I43<>\"\",I43+1,IF(WEEKDAY($C$5)=COLUMNS($C$6:I40),$C$5,\"\"))","v":"2023-02-12"},{"$f":"C45+1","v":"2023-02-13"},"2023-02-14","2023-02-15","2023-02-16","2023-02-17","2023-02-18"]
[null,null,{"$f":"myvlookup(C45,Activities,2)","v":{"$error":"#NAME?"}},{"$f":"myvlookup(D45,Activities,2)","v":{"$error":"#NAME?"}},{"$f":"myvlookup(E45,Activities,2)","v":{"$error":"#NAME?"}},{"$f":"myvlookup(F45,Activities,2)","v":{"$error":"#NAME?"}},{"$f":"myvlookup(G45,Activities,2)","v":{"$error":"#NAME?"}},{"$f":"myvlookup(H45,Activities,2)","v":{"$error":"#NAME?"}},{"$f":"myvlookup(I45,Activities,2)","v":{"$error":"#NAME?"}}]
[null,null,{"$f":"I45+1","v":"2023-02-19"},{"$f":"C47+1","v":"2023-02-20"},"2023-02-21","2023-02-22","2023-02-23","2023-02-24","2023-02-25"]
[null,null,{"$f":"myvlookup(C47,Activities,2)","v":{"$error":"#NAME?"}},{"$f":"myvlookup(D47,Activities,2)","v":{"$error":"#NAME?"}},{"$f":"myvlookup(E47,Activities,2)","v":{"$error":"#NAME?"}},{"$f":"myvlookup(F47,Activities,2)","v":{"$error":"#NAME?"}},{"$f":"myvlookup(G47,Activities,2)","v":{"$error":"#NAME?"}},{"$f":"myvlookup(H47,Activities,2)","v":{"$error":"#NAME?"}},{"$f":"myvlookup(I47,Activities,2)","v":{"$error":"#NAME?"}}]
[null,null,{"$f":"IF(I47<>\"\",I47+1,IF(WEEKDAY($C$5)=COLUMNS($C$6:I40),$C$5,\"\"))","v":"2023-02-26"},{"$f":"C49+1","v":"2023-02-27"},"2023-02-28","2023-03-01","2023-03-02","2023-03-03","2023-03-04"]
[null,null,{"$f":"IF(MONTH(C$49)=MONTH($C$39),myvlookup(C49,Activities,2),\"\")","v":{"$error":"#NAME?"}},{"$f":"IF(MONTH(D$49)=MONTH($C$39),myvlookup(D49,Activities,2),\"\")","v":{"$error":"#NAME?"}},{"$f":"IF(MONTH(E$49)=MONTH($C$39),myvlookup(E49,Activities,2),\"\")","v":{"$error":"#NAME?"}},{"$f":"IF(MONTH(F$49)=MONTH($C$39),myvlookup(F49,Activities,2),\"\")","v":""},{"$f":"IF(MONTH(G$49)=MONTH($C$39),myvlookup(G49,Activities,2),\"\")","v":""},{"$f":"IF(MONTH(H$49)=MONTH($C$39),myvlookup(H49,Activities,2),\"\")","v":""},{"$f":"IF(MONTH(I$49)=MONTH($C$39),myvlookup(I49,Activities,2),\"\")","v":""}]
[null,null,{"$f":"IF(I49<>\"\",I49+1,IF(WEEKDAY($C$5)=COLUMNS($C$5:I41),$C$5,\"\"))","v":"2023-03-05"},{"$f":"C51+1","v":"2023-03-06"},"2023-03-07","2023-03-08","2023-03-09","2023-03-10","2023-03-11"]
[null,null,{"$f":"IF(MONTH(C$51)=MONTH($C$39),myvlookup(C51,Activities,2),\"\")","v":""},{"$f":"IF(MONTH(D$51)=MONTH($C$39),myvlookup(D51,Activities,2),\"\")","v":""},{"$f":"IF(MONTH(E$51)=MONTH($C$39),myvlookup(E51,Activities,2),\"\")","v":""},{"$f":"IF(MONTH(F$51)=MONTH($C$39),myvlookup(F51,Activities,2),\"\")","v":""},{"$f":"IF(MONTH(G$51)=MONTH($C$39),myvlookup(G51,Activities,2),\"\")","v":""},{"$f":"IF(MONTH(H$51)=MONTH($C$39),myvlookup(H51,Activities,2),\"\")","v":""},{"$f":"IF(MONTH(I$51)=MONTH($C$39),myvlookup(I51,Activities,2),\"\")","v":""}]
[]
[]
[]
[2,{"$f":"INDEX('Activity List'!L:L,'Activity List'!$A$1+3)","v":"March"}]
[2,{"$f":"IF(B38=\"December\",B39+1,B39)","v":2023},{"$f":"DATEVALUE(\"1-\"&B56&\"-\"&B57)","v":"2023-03-01"}]
[null,null,"Sun","Mon","Tue","Wed","Thu","Fri","Sat"]
[null,null,{"$f":"IF(WEEKDAY($C$57)=COLUMNS($C$58:C58),$C$57,\"\")","v":""},{"$f":"IF(C59<>\"\",C59+1,IF(WEEKDAY($C$57)=COLUMNS($C$58:D58),$C$57,\"\"))","v":""},{"$f":"IF(D59<>\"\",D59+1,IF(WEEKDAY($C$57)=COLUMNS($C$58:E58),$C$57,\"\"))","v":""},{"$f":"IF(E59<>\"\",E59+1,IF(WEEKDAY($C$57)=COLUMNS($C$58:F58),$C$57,\"\"))","v":"2023-03-01"},{"$f":"IF(F59<>\"\",F59+1,IF(WEEKDAY($C$57)=COLUMNS($C$58:G58),$C$57,\"\"))","v":"2023-03-02"},{"$f":"IF(G59<>\"\",G59+1,IF(WEEKDAY($C$57)=COLUMNS($C$58:H58),$C$57,\"\"))","v":"2023-03-03"},{"$f":"IF(H59<>\"\",H59+1,IF(WEEKDAY($C$57)=COLUMNS($C$58:I58),$C$57,\"\"))","v":"2023-03-04"}]
[null,null,{"$f":"IF(C$59<>\"\",myvlookup(C59,Activities,2),\"\")","v":""},{"$f":"IF(D$59<>\"\",myvlookup(D59,Activities,2),\"\")","v":""},{"$f":"IF(E$59<>\"\",myvlookup(E59,Activities,2),\"\")","v":""},{"$f":"IF(F$59<>\"\",myvlookup(F59,Activities,2),\"\")","v":{"$error":"#NAME?"}},{"$f":"IF(G$59<>\"\",myvlookup(G59,Activities,2),\"\")","v":{"$error":"#NAME?"}},{"$f":"IF(H$59<>\"\",myvlookup(H59,Activities,2),\"\")","v":{"$error":"#NAME?"}},{"$f":"IF(I$59<>\"\",myvlookup(I59,Activities,2),\"\")","v":{"$error":"#NAME?"}}]
[null,null,{"$f":"IF(I59<>\"\",I59+1,IF(WEEKDAY($C$5)=COLUMNS($C$6:I58),$C$5,\"\"))","v":"2023-03-05"},{"$f":"(C61+1)","v":"2023-03-06"},{"$f":"D61+1","v":"2023-03-07"},{"$f":"E61+1","v":"2023-03-08"},{"$f":"F61+1","v":"2023-03-09"},{"$f":"G61+1","v":"2023-03-10"},{"$f":"H61+1","v":"2023-03-11"}]
[null,null,{"$f":"myvlookup(C61,Activities,2)","v":{"$error":"#NAME?"}},{"$f":"myvlookup(D61,Activities,2)","v":{"$error":"#NAME?"}},{"$f":"myvlookup(E61,Activities,2)","v":{"$error":"#NAME?"}},{"$f":"myvlookup(F61,Activities,2)","v":{"$error":"#NAME?"}},{"$f":"myvlookup(G61,Activities,2)","v":{"$error":"#NAME?"}},{"$f":"myvlookup(H61,Activities,2)","v":{"$error":"#NAME?"}},{"$f":"myvlookup(I61,Activities,2)","v":{"$error":"#NAME?"}}]
[null,null,{"$f":"IF(I61<>\"\",I61+1,IF(WEEKDAY($C$5)=COLUMNS($C$6:I58),$C$5,\"\"))","v":"2023-03-12"},{"$f":"C63+1","v":"2023-03-13"},"2023-03-14","2023-03-15","2023-03-16","2023-03-17","2023-03-18"]
[null,null,{"$f":"myvlookup(C63,Activities,2)","v":{"$error":"#NAME?"}},{"$f":"myvlookup(D63,Activities,2)","v":{"$error":"#NAME?"}},{"$f":"myvlookup(E63,Activities,2)","v":{"$error":"#NAME?"}},{"$f":"myvlookup(F63,Activities,2)","v":{"$error":"#NAME?"}},{"$f":"myvlookup(G63,Activities,2)","v":{"$error":"#NAME?"}},{"$f":"myvlookup(H63,Activities,2)","v":{"$error":"#NAME?"}},{"$f":"myvlookup(I63,Activities,2)","v":{"$error":"#NAME?"}}]
[null,null,{"$f":"I63+1","v":"2023-03-19"},{"$f":"C65+1","v":"2023-03-20"},"2023-03-21","2023-03-22","2023-03-23","2023-03-24","2023-03-25"]
[null,null,{"$f":"myvlookup(C65,Activities,2)","v":{"$error":"#NAME?"}},{"$f":"myvlookup(D65,Activities,2)","v":{"$error":"#NAME?"}},{"$f":"myvlookup(E65,Activities,2)","v":{"$error":"#NAME?"}},{"$f":"myvlookup(F65,Activities,2)","v":{"$error":"#NAME?"}},{"$f":"myvlookup(G65,Activities,2)","v":{"$error":"#NAME?"}},{"$f":"myvlookup(H65,Activities,2)","v":{"$error":"#NAME?"}},{"$f":"myvlookup(I65,Activities,2)","v":{"$error":"#NAME?"}}]
[null,null,{"$f":"IF(I65<>\"\",I65+1,IF(WEEKDAY($C$5)=COLUMNS($C$6:I58),$C$5,\"\"))","v":"2023-03-26"},{"$f":"C67+1","v":"2023-03-27"},"2023-03-28","2023-03-29","2023-03-30","2023-03-31","2023-04-01"]
[null,null,{"$f":"IF(MONTH(C$67)=MONTH($C$57),myvlookup(C67,Activities,2),\"\")","v":{"$error":"#NAME?"}},{"$f":"IF(MONTH(D$67)=MONTH($C$57),myvlookup(D67,Activities,2),\"\")","v":{"$error":"#NAME?"}},{"$f":"IF(MONTH(E$67)=MONTH($C$57),myvlookup(E67,Activities,2),\"\")","v":{"$error":"#NAME?"}},{"$f":"IF(MONTH(F$67)=MONTH($C$57),myvlookup(F67,Activities,2),\"\")","v":{"$error":"#NAME?"}},{"$f":"IF(MONTH(G$67)=MONTH($C$57),myvlookup(G67,Activities,2),\"\")","v":{"$error":"#NAME?"}},{"$f":"IF(MONTH(H$67)=MONTH($C$57),myvlookup(H67,Activities,2),\"\")","v":{"$error":"#NAME?"}},{"$f":"IF(MONTH(I$67)=MONTH($C$57),myvlookup(I67,Activities,2),\"\")","v":""}]
[null,null,{"$f":"IF(I67<>\"\",I67+1,IF(WEEKDAY($C$5)=COLUMNS($C$5:I59),$C$5,\"\"))","v":"2023-04-02"},{"$f":"C69+1","v":"2023-04-03"},"2023-04-04","2023-04-05","2023-04-06","2023-04-07","2023-04-08"]
[]
[]
[]
[2,{"$f":"INDEX('Activity List'!L:L,'Activity List'!$A$1+4)","v":"April"}]
[2,{"$f":"IF($B56=\"December\",$B57+1,$B57)","v":2023},{"$f":"DATEVALUE(\"1-\"&B73&\"-\"&B74)","v":"2023-04-01"}]
[null,null,"Sun","Mon","Tue","Wed","Thu","Fri","Sat"]
[null,null,{"$f":"IF(WEEKDAY($C$74)=COLUMNS($C$75:C75),$C$74,\"\")","v":""},{"$f":"IF(C76<>\"\",C76+1,IF(WEEKDAY($C$74)=COLUMNS($C$75:D75),$C$74,\"\"))","v":""},{"$f":"IF(D76<>\"\",D76+1,IF(WEEKDAY($C$74)=COLUMNS($C$75:E75),$C$74,\"\"))","v":""},{"$f":"IF(E76<>\"\",E76+1,IF(WEEKDAY($C$74)=COLUMNS($C$75:F75),$C$74,\"\"))","v":""},{"$f":"IF(F76<>\"\",F76+1,IF(WEEKDAY($C$74)=COLUMNS($C$75:G75),$C$74,\"\"))","v":""},{"$f":"IF(G76<>\"\",G76+1,IF(WEEKDAY($C$74)=COLUMNS($C$75:H75),$C$74,\"\"))","v":""},{"$f":"IF(H76<>\"\",H76+1,IF(WEEKDAY($C$74)=COLUMNS($C$75:I75),$C$74,\"\"))","v":"2023-04-01"}]
[null,null,{"$f":"IF(C76<>\"\",myvlookup(C76,Activities,2),\"\")","v":""},{"$f":"IF(D76<>\"\",myvlookup(D76,Activities,2),\"\")","v":""},{"$f":"IF(E76<>\"\",myvlookup(E76,Activities,2),\"\")","v":""},{"$f":"IF(F76<>\"\",myvlookup(F76,Activities,2),\"\")","v":""},{"$f":"IF(G76<>\"\",myvlookup(G76,Activities,2),\"\")","v":""},{"$f":"IF(H76<>\"\",myvlookup(H76,Activities,2),\"\")","v":""},{"$f":"IF(I76<>\"\",myvlookup(I76,Activities,2),\"\")","v":{"$error":"#NAME?"}}]
[null,null,{"$f":"IF(I76<>\"\",I76+1,IF(WEEKDAY($C$5)=COLUMNS($C$6:I75),$C$5,\"\"))","v":"2023-04-02"},{"$f":"(C78+1)","v":"2023-04-03"},{"$f":"D78+1","v":"2023-04-04"},{"$f":"E78+1","v":"2023-04-05"},{"$f":"F78+1","v":"2023-04-06"},{"$f":"G78+1","v":"2023-04-07"},{"$f":"H78+1","v":"2023-04-08"}]
[null,null,{"$f":"myvlookup(C78,Activities,2)","v":{"$error":"#NAME?"}},{"$f":"myvlookup(D78,Activities,2)","v":{"$error":"#NAME?"}},{"$f":"myvlookup(E78,Activities,2)","v":{"$error":"#NAME?"}},{"$f":"myvlookup(F78,Activities,2)","v":{"$error":"#NAME?"}},{"$f":"myvlookup(G78,Activities,2)","v":{"$error":"#NAME?"}},{"$f":"myvlookup(H78,Activities,2)","v":{"$error":"#NAME?"}},{"$f":"myvlookup(I78,Activities,2)","v":{"$error":"#NAME?"}}]
[null,null,{"$f":"IF(I78<>\"\",I78+1,IF(WEEKDAY($C$5)=COLUMNS($C$6:I75),$C$5,\"\"))","v":"2023-04-09"},{"$f":"C80+1","v":"2023-04-10"},"2023-04-11","2023-04-12","2023-04-13","2023-04-14","2023-04-15"]
[null,null,{"$f":"myvlookup(C80,Activities,2)","v":{"$error":"#NAME?"}},{"$f":"myvlookup(D80,Activities,2)","v":{"$error":"#NAME?"}},{"$f":"myvlookup(E80,Activities,2)","v":{"$error":"#NAME?"}},{"$f":"myvlookup(F80,Activities,2)","v":{"$error":"#NAME?"}},{"$f":"myvlookup(G80,Activities,2)","v":{"$error":"#NAME?"}},{"$f":"myvlookup(H80,Activities,2)","v":{"$error":"#NAME?"}},{"$f":"myvlookup(I80,Activities,2)","v":{"$error":"#NAME?"}}]
[null,null,{"$f":"I80+1","v":"2023-04-16"},{"$f":"C82+1","v":"2023-04-17"},"2023-04-18","2023-04-19","2023-04-20","2023-04-21","2023-04-22"]
[null,null,{"$f":"myvlookup(C82,Activities,2)","v":{"$error":"#NAME?"}},{"$f":"myvlookup(D82,Activities,2)","v":{"$error":"#NAME?"}},{"$f":"myvlookup(E82,Activities,2)","v":{"$error":"#NAME?"}},{"$f":"myvlookup(F82,Activities,2)","v":{"$error":"#NAME?"}},{"$f":"myvlookup(G82,Activities,2)","v":{"$error":"#NAME?"}},{"$f":"myvlookup(H82,Activities,2)","v":{"$error":"#NAME?"}},{"$f":"myvlookup(I82,Activities,2)","v":{"$error":"#NAME?"}}]
[null,null,{"$f":"IF(I82<>\"\",I82+1,IF(WEEKDAY($C$5)=COLUMNS($C$6:I75),$C$5,\"\"))","v":"2023-04-23"},{"$f":"C84+1","v":"2023-04-24"},"2023-04-25","2023-04-26","2023-04-27","2023-04-28","2023-04-29"]
[null,null,{"$f":"IF(MONTH(C84)=MONTH($C74),myvlookup(C84,Activities,2),\"\")","v":{"$error":"#NAME?"}},{"$f":"IF(MONTH(D84)=MONTH($C74),myvlookup(D84,Activities,2),\"\")","v":{"$error":"#NAME?"}},{"$f":"IF(MONTH(E84)=MONTH($C74),myvlookup(E84,Activities,2),\"\")","v":{"$error":"#NAME?"}},{"$f":"IF(MONTH(F84)=MONTH($C74),myvlookup(F84,Activities,2),\"\")","v":{"$error":"#NAME?"}},{"$f":"IF(MONTH(G84)=MONTH($C74),myvlookup(G84,Activities,2),\"\")","v":{"$error":"#NAME?"}},{"$f":"IF(MONTH(H84)=MONTH($C74),myvlookup(H84,Activities,2),\"\")","v":{"$error":"#NAME?"}},{"$f":"IF(MONTH(I84)=MONTH($C74),myvlookup(I84,Activities,2),\"\")","v":{"$error":"#NAME?"}}]
[null,null,{"$f":"IF(I84<>\"\",I84+1,IF(WEEKDAY($C$5)=COLUMNS($C$5:I76),$C$5,\"\"))","v":"2023-04-30"},{"$f":"C86+1","v":"2023-05-01"},"2023-05-02","2023-05-03","2023-05-04","2023-05-05","2023-05-06"]
[null,null,{"$f":"IF(MONTH(C86)=MONTH($C74),myvlookup(C86,Activities,2),\"\")","v":{"$error":"#NAME?"}},{"$f":"IF(MONTH(D86)=MONTH($C74),myvlookup(D86,Activities,2),\"\")","v":""},{"$f":"IF(MONTH(E86)=MONTH($C74),myvlookup(E86,Activities,2),\"\")","v":""},{"$f":"IF(MONTH(F86)=MONTH($C74),myvlookup(F86,Activities,2),\"\")","v":""},{"$f":"IF(MONTH(G86)=MONTH($C74),myvlookup(G86,Activities,2),\"\")","v":""},{"$f":"IF(MONTH(H86)=MONTH($C74),myvlookup(H86,Activities,2),\"\")","v":""},{"$f":"IF(MONTH(I86)=MONTH($C74),myvlookup(I86,Activities,2),\"\")","v":""}]
[]
[]
[]
[2,{"$f":"INDEX('Activity List'!L:L,'Activity List'!$A$1+5)","v":"May"}]
[2,{"$f":"IF($B73=\"December\",$B74+1,$B74)","v":2023},{"$f":"DATEVALUE(\"1-\"&B91&\"-\"&B92)","v":"2023-05-01"}]
[null,null,"Sun","Mon","Tue","Wed","Thu","Fri","Sat"]
[null,null,{"$f":"IF(WEEKDAY($C$92)=COLUMNS($C$93:C93),$C$92,\"\")","v":""},{"$f":"IF(C94<>\"\",C94+1,IF(WEEKDAY($C$92)=COLUMNS($C$93:D93),$C$92,\"\"))","v":"2023-05-01"},{"$f":"IF(D94<>\"\",D94+1,IF(WEEKDAY($C$92)=COLUMNS($C$93:E93),$C$92,\"\"))","v":"2023-05-02"},{"$f":"IF(E94<>\"\",E94+1,IF(WEEKDAY($C$92)=COLUMNS($C$93:F93),$C$92,\"\"))","v":"2023-05-03"},{"$f":"IF(F94<>\"\",F94+1,IF(WEEKDAY($C$92)=COLUMNS($C$93:G93),$C$92,\"\"))","v":"2023-05-04"},{"$f":"IF(G94<>\"\",G94+1,IF(WEEKDAY($C$92)=COLUMNS($C$93:H93),$C$92,\"\"))","v":"2023-05-05"},{"$f":"IF(H94<>\"\",H94+1,IF(WEEKDAY($C$92)=COLUMNS($C$93:I93),$C$92,\"\"))","v":"2023-05-06"}]
[null,null,{"$f":"IF(C94<>\"\",myvlookup(C94,Activities,2),\"\")","v":""},{"$f":"IF(D94<>\"\",myvlookup(D94,Activities,2),\"\")","v":{"$error":"#NAME?"}},{"$f":"IF(E94<>\"\",myvlookup(E94,Activities,2),\"\")","v":{"$error":"#NAME?"}},{"$f":"IF(F94<>\"\",myvlookup(F94,Activities,2),\"\")","v":{"$error":"#NAME?"}},{"$f":"IF(G94<>\"\",myvlookup(G94,Activities,2),\"\")","v":{"$error":"#NAME?"}},{"$f":"IF(H94<>\"\",myvlookup(H94,Activities,2),\"\")","v":{"$error":"#NAME?"}},{"$f":"IF(I94<>\"\",myvlookup(I94,Activities,2),\"\")","v":{"$error":"#NAME?"}}]
[null,null,{"$f":"IF(I94<>\"\",I94+1,IF(WEEKDAY($C$5)=COLUMNS($C$6:I93),$C$5,\"\"))","v":"2023-05-07"},{"$f":"(C96+1)","v":"2023-05-08"},{"$f":"D96+1","v":"2023-05-09"},{"$f":"E96+1","v":"2023-05-10"},{"$f":"F96+1","v":"2023-05-11"},{"$f":"G96+1","v":"2023-05-12"},{"$f":"H96+1","v":"2023-05-13"}]
[null,null,{"$f":"myvlookup(C96,Activities,2)","v":{"$error":"#NAME?"}},{"$f":"myvlookup(D96,Activities,2)","v":{"$error":"#NAME?"}},{"$f":"myvlookup(E96,Activities,2)","v":{"$error":"#NAME?"}},{"$f":"myvlookup(F96,Activities,2)","v":{"$error":"#NAME?"}},{"$f":"myvlookup(G96,Activities,2)","v":{"$error":"#NAME?"}},{"$f":"myvlookup(H96,Activities,2)","v":{"$error":"#NAME?"}},{"$f":"myvlookup(I96,Activities,2)","v":{"$error":"#NAME?"}}]
[null,null,{"$f":"IF(I96<>\"\",I96+1,IF(WEEKDAY($C$5)=COLUMNS($C$6:I93),$C$5,\"\"))","v":"2023-05-14"},{"$f":"C98+1","v":"2023-05-15"},"2023-05-16","2023-05-17","2023-05-18","2023-05-19","2023-05-20"]
[null,null,{"$f":"myvlookup(C98,Activities,2)","v":{"$error":"#NAME?"}},{"$f":"myvlookup(D98,Activities,2)","v":{"$error":"#NAME?"}},{"$f":"myvlookup(E98,Activities,2)","v":{"$error":"#NAME?"}},{"$f":"myvlookup(F98,Activities,2)","v":{"$error":"#NAME?"}},{"$f":"myvlookup(G98,Activities,2)","v":{"$error":"#NAME?"}},{"$f":"myvlookup(H98,Activities,2)","v":{"$error":"#NAME?"}},{"$f":"myvlookup(I98,Activities,2)","v":{"$error":"#NAME?"}}]
[null,null,{"$f":"I98+1","v":"2023-05-21"},{"$f":"C100+1","v":"2023-05-22"},"2023-05-23","2023-05-24","2023-05-25","2023-05-26","2023-05-27"]
[null,null,{"$f":"myvlookup(C100,Activities,2)","v":{"$error":"#NAME?"}},{"$f":"myvlookup(D100,Activities,2)","v":{"$error":"#NAME?"}},{"$f":"myvlookup(E100,Activities,2)","v":{"$error":"#NAME?"}},{"$f":"myvlookup(F100,Activities,2)","v":{"$error":"#NAME?"}},{"$f":"myvlookup(G100,Activities,2)","v":{"$error":"#NAME?"}},{"$f":"myvlookup(H100,Activities,2)","v":{"$error":"#NAME?"}},{"$f":"myvlookup(I100,Activities,2)","v":{"$error":"#NAME?"}}]
[null,null,{"$f":"IF(I100<>\"\",I100+1,IF(WEEKDAY($C$5)=COLUMNS($C$6:I93),$C$5,\"\"))","v":"2023-05-28"},{"$f":"C102+1","v":"2023-05-29"},"2023-05-30","2023-05-31","2023-06-01","2023-06-02","2023-06-03"]
[null,null,{"$f":"IF(MONTH(C102)=MONTH($C92),myvlookup(C102,Activities,2),\"\")","v":{"$error":"#NAME?"}},{"$f":"IF(MONTH(D102)=MONTH($C92),myvlookup(D102,Activities,2),\"\")","v":{"$error":"#NAME?"}},{"$f":"IF(MONTH(E102)=MONTH($C92),myvlookup(E102,Activities,2),\"\")","v":{"$error":"#NAME?"}},{"$f":"IF(MONTH(F102)=MONTH($C92),myvlookup(F102,Activities,2),\"\")","v":{"$error":"#NAME?"}},{"$f":"IF(MONTH(G102)=MONTH($C92),myvlookup(G102,Activities,2),\"\")","v":""},{"$f":"IF(MONTH(H102)=MONTH($C92),myvlookup(H102,Activities,2),\"\")","v":""},{"$f":"IF(MONTH(I102)=MONTH($C92),myvlookup(I102,Activities,2),\"\")","v":""}]
[null,null,{"$f":"IF(I102<>\"\",I102+1,IF(WEEKDAY($C$5)=COLUMNS($C$5:I94),$C$5,\"\"))","v":"2023-06-04"},{"$f":"C104+1","v":"2023-06-05"},"2023-06-06","2023-06-07","2023-06-08","2023-06-09","2023-06-10"]
[null,null,{"$f":"IF(MONTH(C104)=MONTH($C92),myvlookup(C104,Activities,2),\"\")","v":""},{"$f":"IF(MONTH(D104)=MONTH($C92),myvlookup(D104,Activities,2),\"\")","v":""},{"$f":"IF(MONTH(E104)=MONTH($C92),myvlookup(E104,Activities,2),\"\")","v":""},{"$f":"IF(MONTH(F104)=MONTH($C92),myvlookup(F104,Activities,2),\"\")","v":""},{"$f":"IF(MONTH(G104)=MONTH($C92),myvlookup(G104,Activities,2),\"\")","v":""},{"$f":"IF(MONTH(H104)=MONTH($C92),myvlookup(H104,Activities,2),\"\")","v":""},{"$f":"IF(MONTH(I104)=MONTH($C92),myvlookup(I104,Activities,2),\"\")","v":""}]
[]
[]
[]
[2,{"$f":"INDEX('Activity List'!L:L,'Activity List'!$A$1+6)","v":"June"}]
[2,{"$f":"IF($B91=\"December\",$B92+1,$B92)","v":2023},{"$f":"DATEVALUE(\"1-\"&B109&\"-\"&B110)","v":"2023-06-01"}]
[null,null,"Sun","Mon","Tue","Wed","Thu","Fri","Sat"]
[null,null,{"$f":"IF(WEEKDAY($C$110)=COLUMNS($C$111:C111),$C$110,\"\")","v":""},{"$f":"IF(C112<>\"\",C112+1,IF(WEEKDAY($C$110)=COLUMNS($C$111:D111),$C$110,\"\"))","v":""},{"$f":"IF(D112<>\"\",D112+1,IF(WEEKDAY($C$110)=COLUMNS($C$111:E111),$C$110,\"\"))","v":""},{"$f":"IF(E112<>\"\",E112+1,IF(WEEKDAY($C$110)=COLUMNS($C$111:F111),$C$110,\"\"))","v":""},{"$f":"IF(F112<>\"\",F112+1,IF(WEEKDAY($C$110)=COLUMNS($C$111:G111),$C$110,\"\"))","v":"2023-06-01"},{"$f":"IF(G112<>\"\",G112+1,IF(WEEKDAY($C$110)=COLUMNS($C$111:H111),$C$110,\"\"))","v":"2023-06-02"},{"$f":"IF(H112<>\"\",H112+1,IF(WEEKDAY($C$110)=COLUMNS($C$111:I111),$C$110,\"\"))","v":"2023-06-03"}]
[null,null,{"$f":"IF(C112<>\"\",myvlookup(C112,Activities,2),\"\")","v":""},{"$f":"IF(D112<>\"\",myvlookup(D112,Activities,2),\"\")","v":""},{"$f":"IF(E112<>\"\",myvlookup(E112,Activities,2),\"\")","v":""},{"$f":"IF(F112<>\"\",myvlookup(F112,Activities,2),\"\")","v":""},{"$f":"IF(G112<>\"\",myvlookup(G112,Activities,2),\"\")","v":{"$error":"#NAME?"}},{"$f":"IF(H112<>\"\",myvlookup(H112,Activities,2),\"\")","v":{"$error":"#NAME?"}},{"$f":"IF(I112<>\"\",myvlookup(I112,Activities,2),\"\")","v":{"$error":"#NAME?"}}]
[null,null,{"$f":"IF(I112<>\"\",I112+1,IF(WEEKDAY($C$5)=COLUMNS($C$6:I111),$C$5,\"\"))","v":"2023-06-04"},{"$f":"(C114+1)","v":"2023-06-05"},{"$f":"D114+1","v":"2023-06-06"},{"$f":"E114+1","v":"2023-06-07"},{"$f":"F114+1","v":"2023-06-08"},{"$f":"G114+1","v":"2023-06-09"},{"$f":"H114+1","v":"2023-06-10"}]
[null,null,{"$f":"myvlookup(C114,Activities,2)","v":{"$error":"#NAME?"}},{"$f":"myvlookup(D114,Activities,2)","v":{"$error":"#NAME?"}},{"$f":"myvlookup(E114,Activities,2)","v":{"$error":"#NAME?"}},{"$f":"myvlookup(F114,Activities,2)","v":{"$error":"#NAME?"}},{"$f":"myvlookup(G114,Activities,2)","v":{"$error":"#NAME?"}},{"$f":"myvlookup(H114,Activities,2)","v":{"$error":"#NAME?"}},{"$f":"myvlookup(I114,Activities,2)","v":{"$error":"#NAME?"}}]
[null,null,{"$f":"IF(I114<>\"\",I114+1,IF(WEEKDAY($C$5)=COLUMNS($C$6:I111),$C$5,\"\"))","v":"2023-06-11"},{"$f":"C116+1","v":"2023-06-12"},"2023-06-13","2023-06-14","2023-06-15","2023-06-16","2023-06-17"]
[null,null,{"$f":"myvlookup(C116,Activities,2)","v":{"$error":"#NAME?"}},{"$f":"myvlookup(D116,Activities,2)","v":{"$error":"#NAME?"}},{"$f":"myvlookup(E116,Activities,2)","v":{"$error":"#NAME?"}},{"$f":"myvlookup(F116,Activities,2)","v":{"$error":"#NAME?"}},{"$f":"myvlookup(G116,Activities,2)","v":{"$error":"#NAME?"}},{"$f":"myvlookup(H116,Activities,2)","v":{"$error":"#NAME?"}},{"$f":"myvlookup(I116,Activities,2)","v":{"$error":"#NAME?"}}]
[null,null,{"$f":"I116+1","v":"2023-06-18"},{"$f":"C118+1","v":"2023-06-19"},"2023-06-20","2023-06-21","2023-06-22","2023-06-23","2023-06-24"]
[null,null,{"$f":"myvlookup(C118,Activities,2)","v":{"$error":"#NAME?"}},{"$f":"myvlookup(D118,Activities,2)","v":{"$error":"#NAME?"}},{"$f":"myvlookup(E118,Activities,2)","v":{"$error":"#NAME?"}},{"$f":"myvlookup(F118,Activities,2)","v":{"$error":"#NAME?"}},{"$f":"myvlookup(G118,Activities,2)","v":{"$error":"#NAME?"}},{"$f":"myvlookup(H118,Activities,2)","v":{"$error":"#NAME?"}},{"$f":"myvlookup(I118,Activities,2)","v":{"$error":"#NAME?"}}]
[null,null,{"$f":"IF(I118<>\"\",I118+1,IF(WEEKDAY($C$5)=COLUMNS($C$6:I111),$C$5,\"\"))","v":"2023-06-25"},{"$f":"C120+1","v":"2023-06-26"},"2023-06-27","2023-06-28","2023-06-29","2023-06-30","2023-07-01"]
[null,null,{"$f":"IF(MONTH(C120)=MONTH($C110),myvlookup(C120,Activities,2),\"\")","v":{"$error":"#NAME?"}},{"$f":"IF(MONTH(D120)=MONTH($C110),myvlookup(D120,Activities,2),\"\")","v":{"$error":"#NAME?"}},{"$f":"IF(MONTH(E120)=MONTH($C110),myvlookup(E120,Activities,2),\"\")","v":{"$error":"#NAME?"}},{"$f":"IF(MONTH(F120)=MONTH($C110),myvlookup(F120,Activities,2),\"\")","v":{"$error":"#NAME?"}},{"$f":"IF(MONTH(G120)=MONTH($C110),myvlookup(G120,Activities,2),\"\")","v":{"$error":"#NAME?"}},{"$f":"IF(MONTH(H120)=MONTH($C110),myvlookup(H120,Activities,2),\"\")","v":{"$error":"#NAME?"}},{"$f":"IF(MONTH(I120)=MONTH($C110),myvlookup(I120,Activities,2),\"\")","v":""}]
[null,null,{"$f":"IF(I120<>\"\",I120+1,IF(WEEKDAY($C$5)=COLUMNS($C$5:I112),$C$5,\"\"))","v":"2023-07-02"},{"$f":"C122+1","v":"2023-07-03"},"2023-07-04","2023-07-05","2023-07-06","2023-07-07","2023-07-08"]
[null,null,{"$f":"IF(MONTH(C122)=MONTH($C110),myvlookup(C122,Activities,2),\"\")","v":""},{"$f":"IF(MONTH(D122)=MONTH($C110),myvlookup(D122,Activities,2),\"\")","v":""},{"$f":"IF(MONTH(E122)=MONTH($C110),myvlookup(E122,Activities,2),\"\")","v":""},{"$f":"IF(MONTH(F122)=MONTH($C110),myvlookup(F122,Activities,2),\"\")","v":""},{"$f":"IF(MONTH(G122)=MONTH($C110),myvlookup(G122,Activities,2),\"\")","v":""},{"$f":"IF(MONTH(H122)=MONTH($C110),myvlookup(H122,Activities,2),\"\")","v":""},{"$f":"IF(MONTH(I122)=MONTH($C110),myvlookup(I122,Activities,2),\"\")","v":""}]
[]
[]
[]
[2,{"$f":"INDEX('Activity List'!L:L,'Activity List'!$A$1+7)","v":"July"}]
[2,{"$f":"IF($B109=\"December\",$B110+1,$B110)","v":2023},{"$f":"DATEVALUE(\"1-\"&B127&\"-\"&B128)","v":"2023-07-01"}]
[null,null,"Sun","Mon","Tue","Wed","Thu","Fri","Sat"]
[null,null,{"$f":"IF(WEEKDAY($C$128)=COLUMNS($C$129:C129),$C$128,\"\")","v":""},{"$f":"IF(C130<>\"\",C130+1,IF(WEEKDAY($C$128)=COLUMNS($C$129:D129),$C$128,\"\"))","v":""},{"$f":"IF(D130<>\"\",D130+1,IF(WEEKDAY($C$128)=COLUMNS($C$129:E129),$C$128,\"\"))","v":""},{"$f":"IF(E130<>\"\",E130+1,IF(WEEKDAY($C$128)=COLUMNS($C$129:F129),$C$128,\"\"))","v":""},{"$f":"IF(F130<>\"\",F130+1,IF(WEEKDAY($C$128)=COLUMNS($C$129:G129),$C$128,\"\"))","v":""},{"$f":"IF(G130<>\"\",G130+1,IF(WEEKDAY($C$128)=COLUMNS($C$129:H129),$C$128,\"\"))","v":""},{"$f":"IF(H130<>\"\",H130+1,IF(WEEKDAY($C$128)=COLUMNS($C$129:I129),$C$128,\"\"))","v":"2023-07-01"}]
[null,null,{"$f":"IF(C130<>\"\",myvlookup(C130,Activities,2),\"\")","v":""},{"$f":"IF(D130<>\"\",myvlookup(D130,Activities,2),\"\")","v":""},{"$f":"IF(E130<>\"\",myvlookup(E130,Activities,2),\"\")","v":""},{"$f":"IF(F130<>\"\",myvlookup(F130,Activities,2),\"\")","v":""},{"$f":"IF(G130<>\"\",myvlookup(G130,Activities,2),\"\")","v":""},{"$f":"IF(H130<>\"\",myvlookup(H130,Activities,2),\"\")","v":""},{"$f":"IF(I130<>\"\",myvlookup(I130,Activities,2),\"\")","v":{"$error":"#NAME?"}}]
[null,null,{"$f":"IF(I130<>\"\",I130+1,IF(WEEKDAY($C$5)=COLUMNS($C$6:I129),$C$5,\"\"))","v":"2023-07-02"},{"$f":"(C132+1)","v":"2023-07-03"},{"$f":"D132+1","v":"2023-07-04"},{"$f":"E132+1","v":"2023-07-05"},{"$f":"F132+1","v":"2023-07-06"},{"$f":"G132+1","v":"2023-07-07"},{"$f":"H132+1","v":"2023-07-08"}]
[null,null,{"$f":"myvlookup(C132,Activities,2)","v":{"$error":"#NAME?"}},{"$f":"myvlookup(D132,Activities,2)","v":{"$error":"#NAME?"}},{"$f":"myvlookup(E132,Activities,2)","v":{"$error":"#NAME?"}},{"$f":"myvlookup(F132,Activities,2)","v":{"$error":"#NAME?"}},{"$f":"myvlookup(G132,Activities,2)","v":{"$error":"#NAME?"}},{"$f":"myvlookup(H132,Activities,2)","v":{"$error":"#NAME?"}},{"$f":"myvlookup(I132,Activities,2)","v":{"$error":"#NAME?"}}]
[null,null,{"$f":"IF(I132<>\"\",I132+1,IF(WEEKDAY($C$5)=COLUMNS($C$6:I129),$C$5,\"\"))","v":"2023-07-09"},{"$f":"C134+1","v":"2023-07-10"},"2023-07-11","2023-07-12","2023-07-13","2023-07-14","2023-07-15"]
[null,null,{"$f":"myvlookup(C134,Activities,2)","v":{"$error":"#NAME?"}},{"$f":"myvlookup(D134,Activities,2)","v":{"$error":"#NAME?"}},{"$f":"myvlookup(E134,Activities,2)","v":{"$error":"#NAME?"}},{"$f":"myvlookup(F134,Activities,2)","v":{"$error":"#NAME?"}},{"$f":"myvlookup(G134,Activities,2)","v":{"$error":"#NAME?"}},{"$f":"myvlookup(H134,Activities,2)","v":{"$error":"#NAME?"}},{"$f":"myvlookup(I134,Activities,2)","v":{"$error":"#NAME?"}}]
[null,null,{"$f":"I134+1","v":"2023-07-16"},{"$f":"C136+1","v":"2023-07-17"},"2023-07-18","2023-07-19","2023-07-20","2023-07-21","2023-07-22"]
[null,null,{"$f":"myvlookup(C136,Activities,2)","v":{"$error":"#NAME?"}},{"$f":"myvlookup(D136,Activities,2)","v":{"$error":"#NAME?"}},{"$f":"myvlookup(E136,Activities,2)","v":{"$error":"#NAME?"}},{"$f":"myvlookup(F136,Activities,2)","v":{"$error":"#NAME?"}},{"$f":"myvlookup(G136,Activities,2)","v":{"$error":"#NAME?"}},{"$f":"myvlookup(H136,Activities,2)","v":{"$error":"#NAME?"}},{"$f":"myvlookup(I136,Activities,2)","v":{"$error":"#NAME?"}}]
[null,null,{"$f":"IF(I136<>\"\",I136+1,IF(WEEKDAY($C$5)=COLUMNS($C$6:I129),$C$5,\"\"))","v":"2023-07-23"},{"$f":"C138+1","v":"2023-07-24"},"2023-07-25","2023-07-26","2023-07-27","2023-07-28","2023-07-29"]
[null,null,{"$f":"IF(MONTH(C138)=MONTH($C128),myvlookup(C138,Activities,2),\"\")","v":{"$error":"#NAME?"}},{"$f":"IF(MONTH(D138)=MONTH($C128),myvlookup(D138,Activities,2),\"\")","v":{"$error":"#NAME?"}},{"$f":"IF(MONTH(E138)=MONTH($C128),myvlookup(E138,Activities,2),\"\")","v":{"$error":"#NAME?"}},{"$f":"IF(MONTH(F138)=MONTH($C128),myvlookup(F138,Activities,2),\"\")","v":{"$error":"#NAME?"}},{"$f":"IF(MONTH(G138)=MONTH($C128),myvlookup(G138,Activities,2),\"\")","v":{"$error":"#NAME?"}},{"$f":"IF(MONTH(H138)=MONTH($C128),myvlookup(H138,Activities,2),\"\")","v":{"$error":"#NAME?"}},{"$f":"IF(MONTH(I138)=MONTH($C128),myvlookup(I138,Activities,2),\"\")","v":{"$error":"#NAME?"}}]
[null,null,{"$f":"IF(I138<>\"\",I138+1,IF(WEEKDAY($C$5)=COLUMNS($C$5:I130),$C$5,\"\"))","v":"2023-07-30"},{"$f":"C140+1","v":"2023-07-31"},"2023-08-01","2023-08-02","2023-08-03","2023-08-04","2023-08-05"]
[null,null,{"$f":"IF(MONTH(C140)=MONTH($C128),myvlookup(C140,Activities,2),\"\")","v":{"$error":"#NAME?"}},{"$f":"IF(MONTH(D140)=MONTH($C128),myvlookup(D140,Activities,2),\"\")","v":{"$error":"#NAME?"}},{"$f":"IF(MONTH(E140)=MONTH($C128),myvlookup(E140,Activities,2),\"\")","v":""},{"$f":"IF(MONTH(F140)=MONTH($C128),myvlookup(F140,Activities,2),\"\")","v":""},{"$f":"IF(MONTH(G140)=MONTH($C128),myvlookup(G140,Activities,2),\"\")","v":""},{"$f":"IF(MONTH(H140)=MONTH($C128),myvlookup(H140,Activities,2),\"\")","v":""},{"$f":"IF(MONTH(I140)=MONTH($C128),myvlookup(I140,Activities,2),\"\")","v":""}]
[]
[]
[]
[2,{"$f":"INDEX('Activity List'!L:L,'Activity List'!$A$1+8)","v":"August"}]
[2,{"$f":"IF($B127=\"December\",$B128+1,$B128)","v":2023},{"$f":"DATEVALUE(\"1-\"&B145&\"-\"&B146)","v":"2023-08-01"}]
[null,null,"Sun","Mon","Tue","Wed","Thu","Fri","Sat"]
[null,null,{"$f":"IF(WEEKDAY($C$146)=COLUMNS($C$147:C147),$C$146,\"\")","v":""},{"$f":"IF(C148<>\"\",C148+1,IF(WEEKDAY($C146)=COLUMNS($C147:D147),$C146,\"\"))","v":""},{"$f":"IF(D148<>\"\",D148+1,IF(WEEKDAY($C146)=COLUMNS($C147:E147),$C146,\"\"))","v":"2023-08-01"},{"$f":"IF(E148<>\"\",E148+1,IF(WEEKDAY($C146)=COLUMNS($C147:F147),$C146,\"\"))","v":"2023-08-02"},{"$f":"IF(F148<>\"\",F148+1,IF(WEEKDAY($C146)=COLUMNS($C147:G147),$C146,\"\"))","v":"2023-08-03"},{"$f":"IF(G148<>\"\",G148+1,IF(WEEKDAY($C146)=COLUMNS($C147:H147),$C146,\"\"))","v":"2023-08-04"},{"$f":"IF(H148<>\"\",H148+1,IF(WEEKDAY($C146)=COLUMNS($C147:I147),$C146,\"\"))","v":"2023-08-05"}]
[null,null,{"$f":"IF(C148<>\"\",myvlookup(C148,Activities,2),\"\")","v":""},{"$f":"IF(D148<>\"\",myvlookup(D148,Activities,2),\"\")","v":""},{"$f":"IF(E148<>\"\",myvlookup(E148,Activities,2),\"\")","v":{"$error":"#NAME?"}},{"$f":"IF(F148<>\"\",myvlookup(F148,Activities,2),\"\")","v":{"$error":"#NAME?"}},{"$f":"IF(G148<>\"\",myvlookup(G148,Activities,2),\"\")","v":{"$error":"#NAME?"}},{"$f":"IF(H148<>\"\",myvlookup(H148,Activities,2),\"\")","v":{"$error":"#NAME?"}},{"$f":"IF(I148<>\"\",myvlookup(I148,Activities,2),\"\")","v":{"$error":"#NAME?"}}]
[null,null,{"$f":"IF(I148<>\"\",I148+1,IF(WEEKDAY($C$5)=COLUMNS($C$6:I147),$C$5,\"\"))","v":"2023-08-06"},{"$f":"(C150+1)","v":"2023-08-07"},{"$f":"D150+1","v":"2023-08-08"},{"$f":"E150+1","v":"2023-08-09"},{"$f":"F150+1","v":"2023-08-10"},{"$f":"G150+1","v":"2023-08-11"},{"$f":"H150+1","v":"2023-08-12"}]
[null,null,{"$f":"myvlookup(C150,Activities,2)","v":{"$error":"#NAME?"}},{"$f":"myvlookup(D150,Activities,2)","v":{"$error":"#NAME?"}},{"$f":"myvlookup(E150,Activities,2)","v":{"$error":"#NAME?"}},{"$f":"myvlookup(F150,Activities,2)","v":{"$error":"#NAME?"}},{"$f":"myvlookup(G150,Activities,2)","v":{"$error":"#NAME?"}},{"$f":"myvlookup(H150,Activities,2)","v":{"$error":"#NAME?"}},{"$f":"myvlookup(I150,Activities,2)","v":{"$error":"#NAME?"}}]
[null,null,{"$f":"IF(I150<>\"\",I150+1,IF(WEEKDAY($C$5)=COLUMNS($C$6:I147),$C$5,\"\"))","v":"2023-08-13"},{"$f":"C152+1","v":"2023-08-14"},"2023-08-15","2023-08-16","2023-08-17","2023-08-18","2023-08-19"]
[null,null,{"$f":"myvlookup(C152,Activities,2)","v":{"$error":"#NAME?"}},{"$f":"myvlookup(D152,Activities,2)","v":{"$error":"#NAME?"}},{"$f":"myvlookup(E152,Activities,2)","v":{"$error":"#NAME?"}},{"$f":"myvlookup(F152,Activities,2)","v":{"$error":"#NAME?"}},{"$f":"myvlookup(G152,Activities,2)","v":{"$error":"#NAME?"}},{"$f":"myvlookup(H152,Activities,2)","v":{"$error":"#NAME?"}},{"$f":"myvlookup(I152,Activities,2)","v":{"$error":"#NAME?"}}]
[null,null,{"$f":"I152+1","v":"2023-08-20"},{"$f":"C154+1","v":"2023-08-21"},"2023-08-22","2023-08-23","2023-08-24","2023-08-25","2023-08-26"]
[null,null,{"$f":"myvlookup(C154,Activities,2)","v":{"$error":"#NAME?"}},{"$f":"myvlookup(D154,Activities,2)","v":{"$error":"#NAME?"}},{"$f":"myvlookup(E154,Activities,2)","v":{"$error":"#NAME?"}},{"$f":"myvlookup(F154,Activities,2)","v":{"$error":"#NAME?"}},{"$f":"myvlookup(G154,Activities,2)","v":{"$error":"#NAME?"}},{"$f":"myvlookup(H154,Activities,2)","v":{"$error":"#NAME?"}},{"$f":"myvlookup(I154,Activities,2)","v":{"$error":"#NAME?"}}]
[null,null,{"$f":"IF(I154<>\"\",I154+1,IF(WEEKDAY($C$5)=COLUMNS($C$6:I147),$C$5,\"\"))","v":"2023-08-27"},{"$f":"C156+1","v":"2023-08-28"},"2023-08-29","2023-08-30","2023-08-31","2023-09-01","2023-09-02"]
[null,null,{"$f":"IF(MONTH(C156)=MONTH($C146),myvlookup(C156,Activities,2),\"\")","v":{"$error":"#NAME?"}},{"$f":"IF(MONTH(D156)=MONTH($C146),myvlookup(D156,Activities,2),\"\")","v":{"$error":"#NAME?"}},{"$f":"IF(MONTH(E156)=MONTH($C146),myvlookup(E156,Activities,2),\"\")","v":{"$error":"#NAME?"}},{"$f":"IF(MONTH(F156)=MONTH($C146),myvlookup(F156,Activities,2),\"\")","v":{"$error":"#NAME?"}},{"$f":"IF(MONTH(G156)=MONTH($C146),myvlookup(G156,Activities,2),\"\")","v":{"$error":"#NAME?"}},{"$f":"IF(MONTH(H156)=MONTH($C146),myvlookup(H156,Activities,2),\"\")","v":""},{"$f":"IF(MONTH(I156)=MONTH($C146),myvlookup(I156,Activities,2),\"\")","v":""}]
[null,null,{"$f":"IF(I156<>\"\",I156+1,IF(WEEKDAY($C$5)=COLUMNS($C$5:I148),$C$5,\"\"))","v":"2023-09-03"},{"$f":"C158+1","v":"2023-09-04"},"2023-09-05","2023-09-06","2023-09-07","2023-09-08","2023-09-09"]
[null,null,{"$f":"IF(MONTH(C158)=MONTH($C146),myvlookup(C158,Activities,2),\"\")","v":""},{"$f":"IF(MONTH(D158)=MONTH($C146),myvlookup(D158,Activities,2),\"\")","v":""},{"$f":"IF(MONTH(E158)=MONTH($C146),myvlookup(E158,Activities,2),\"\")","v":""},{"$f":"IF(MONTH(F158)=MONTH($C146),myvlookup(F158,Activities,2),\"\")","v":""},{"$f":"IF(MONTH(G158)=MONTH($C146),myvlookup(G158,Activities,2),\"\")","v":""},{"$f":"IF(MONTH(H158)=MONTH($C146),myvlookup(H158,Activities,2),\"\")","v":""},{"$f":"IF(MONTH(I158)=MONTH($C146),myvlookup(I158,Activities,2),\"\")","v":""}]
[]
[]
[]
[2,{"$f":"INDEX('Activity List'!L:L,'Activity List'!$A$1+9)","v":"September"}]
[2,{"$f":"IF($B145=\"December\",$B146+1,$B146)","v":2023},{"$f":"DATEVALUE(\"1-\"&B163&\"-\"&B164)","v":"2023-09-01"}]
[null,null,"Sun","Mon","Tue","Wed","Thu","Fri","Sat"]
[null,null,{"$f":"IF(WEEKDAY($C$164)=COLUMNS($C$165:C165),$C$164,\"\")","v":""},{"$f":"IF(C166<>\"\",C166+1,IF(WEEKDAY($C164)=COLUMNS($C165:D165),$C164,\"\"))","v":""},{"$f":"IF(D166<>\"\",D166+1,IF(WEEKDAY($C164)=COLUMNS($C165:E165),$C164,\"\"))","v":""},{"$f":"IF(E166<>\"\",E166+1,IF(WEEKDAY($C164)=COLUMNS($C165:F165),$C164,\"\"))","v":""},{"$f":"IF(F166<>\"\",F166+1,IF(WEEKDAY($C164)=COLUMNS($C165:G165),$C164,\"\"))","v":""},{"$f":"IF(G166<>\"\",G166+1,IF(WEEKDAY($C164)=COLUMNS($C165:H165),$C164,\"\"))","v":"2023-09-01"},{"$f":"IF(H166<>\"\",H166+1,IF(WEEKDAY($C164)=COLUMNS($C165:I165),$C164,\"\"))","v":"2023-09-02"}]
[null,null,{"$f":"IF(C166<>\"\",myvlookup(C166,Activities,2),\"\")","v":""},{"$f":"IF(D166<>\"\",myvlookup(D166,Activities,2),\"\")","v":""},{"$f":"IF(E166<>\"\",myvlookup(E166,Activities,2),\"\")","v":""},{"$f":"IF(F166<>\"\",myvlookup(F166,Activities,2),\"\")","v":""},{"$f":"IF(G166<>\"\",myvlookup(G166,Activities,2),\"\")","v":""},{"$f":"IF(H166<>\"\",myvlookup(H166,Activities,2),\"\")","v":{"$error":"#NAME?"}},{"$f":"IF(I166<>\"\",myvlookup(I166,Activities,2),\"\")","v":{"$error":"#NAME?"}}]
[null,null,{"$f":"IF(I166<>\"\",I166+1,IF(WEEKDAY($C$5)=COLUMNS($C$6:I165),$C$5,\"\"))","v":"2023-09-03"},{"$f":"(C168+1)","v":"2023-09-04"},{"$f":"D168+1","v":"2023-09-05"},{"$f":"E168+1","v":"2023-09-06"},{"$f":"F168+1","v":"2023-09-07"},{"$f":"G168+1","v":"2023-09-08"},{"$f":"H168+1","v":"2023-09-09"}]
[null,null,{"$f":"myvlookup(C168,Activities,2)","v":{"$error":"#NAME?"}},{"$f":"myvlookup(D168,Activities,2)","v":{"$error":"#NAME?"}},{"$f":"myvlookup(E168,Activities,2)","v":{"$error":"#NAME?"}},{"$f":"myvlookup(F168,Activities,2)","v":{"$error":"#NAME?"}},{"$f":"myvlookup(G168,Activities,2)","v":{"$error":"#NAME?"}},{"$f":"myvlookup(H168,Activities,2)","v":{"$error":"#NAME?"}},{"$f":"myvlookup(I168,Activities,2)","v":{"$error":"#NAME?"}}]
[null,null,{"$f":"IF(I168<>\"\",I168+1,IF(WEEKDAY($C$5)=COLUMNS($C$6:I165),$C$5,\"\"))","v":"2023-09-10"},{"$f":"C170+1","v":"2023-09-11"},"2023-09-12","2023-09-13","2023-09-14","2023-09-15","2023-09-16"]
[null,null,{"$f":"myvlookup(C170,Activities,2)","v":{"$error":"#NAME?"}},{"$f":"myvlookup(D170,Activities,2)","v":{"$error":"#NAME?"}},{"$f":"myvlookup(E170,Activities,2)","v":{"$error":"#NAME?"}},{"$f":"myvlookup(F170,Activities,2)","v":{"$error":"#NAME?"}},{"$f":"myvlookup(G170,Activities,2)","v":{"$error":"#NAME?"}},{"$f":"myvlookup(H170,Activities,2)","v":{"$error":"#NAME?"}},{"$f":"myvlookup(I170,Activities,2)","v":{"$error":"#NAME?"}}]
[null,null,{"$f":"I170+1","v":"2023-09-17"},{"$f":"C172+1","v":"2023-09-18"},"2023-09-19","2023-09-20","2023-09-21","2023-09-22","2023-09-23"]
[null,null,{"$f":"myvlookup(C172,Activities,2)","v":{"$error":"#NAME?"}},{"$f":"myvlookup(D172,Activities,2)","v":{"$error":"#NAME?"}},{"$f":"myvlookup(E172,Activities,2)","v":{"$error":"#NAME?"}},{"$f":"myvlookup(F172,Activities,2)","v":{"$error":"#NAME?"}},{"$f":"myvlookup(G172,Activities,2)","v":{"$error":"#NAME?"}},{"$f":"myvlookup(H172,Activities,2)","v":{"$error":"#NAME?"}},{"$f":"myvlookup(I172,Activities,2)","v":{"$error":"#NAME?"}}]
[null,null,{"$f":"IF(I172<>\"\",I172+1,IF(WEEKDAY($C$5)=COLUMNS($C$6:I165),$C$5,\"\"))","v":"2023-09-24"},{"$f":"C174+1","v":"2023-09-25"},"2023-09-26","2023-09-27","2023-09-28","2023-09-29","2023-09-30"]
[null,null,{"$f":"myvlookup(C174,Activities,2)","v":{"$error":"#NAME?"}},{"$f":"myvlookup(D174,Activities,2)","v":{"$error":"#NAME?"}},{"$f":"myvlookup(E174,Activities,2)","v":{"$error":"#NAME?"}},{"$f":"myvlookup(F174,Activities,2)","v":{"$error":"#NAME?"}},{"$f":"myvlookup(G174,Activities,2)","v":{"$error":"#NAME?"}},{"$f":"myvlookup(H174,Activities,2)","v":{"$error":"#NAME?"}},{"$f":"myvlookup(I174,Activities,2)","v":{"$error":"#NAME?"}}]
[null,null,{"$f":"IF(I174<>\"\",I174+1,IF(WEEKDAY($C$5)=COLUMNS($C$6:I167),$C$5,\"\"))","v":"2023-10-01"},{"$f":"C176+1","v":"2023-10-02"},{"$f":"D176+1","v":"2023-10-03"},{"$f":"E176+1","v":"2023-10-04"},{"$f":"F176+1","v":"2023-10-05"},{"$f":"G176+1","v":"2023-10-06"},{"$f":"H176+1","v":"2023-10-07"}]
[null,null,{"$f":"IF(MONTH(C176)=MONTH($C164),myvlookup(C176,Activities,2),\"\")","v":""},{"$f":"IF(MONTH(D176)=MONTH($C164),myvlookup(D176,Activities,2),\"\")","v":""},{"$f":"IF(MONTH(E176)=MONTH($C164),myvlookup(E176,Activities,2),\"\")","v":""},{"$f":"IF(MONTH(F176)=MONTH($C164),myvlookup(F176,Activities,2),\"\")","v":""},{"$f":"IF(MONTH(G176)=MONTH($C164),myvlookup(G176,Activities,2),\"\")","v":""},{"$f":"IF(MONTH(H176)=MONTH($C164),myvlookup(H176,Activities,2),\"\")","v":""},{"$f":"IF(MONTH(I176)=MONTH($C164),myvlookup(I176,Activities,2),\"\")","v":""}]
[]
[]
[]
[2,{"$f":"INDEX('Activity List'!L:L,'Activity List'!$A$1+10)","v":"October"}]
[2,{"$f":"IF($B163=\"December\",$B164+1,$B164)","v":2023},{"$f":"DATEVALUE(\"1-\"&B181&\"-\"&B182)","v":"2023-10-01"}]
[null,null,"Sun","Mon","Tue","Wed","Thu","Fri","Sat"]
[null,null,{"$f":"IF(WEEKDAY($C$182)=COLUMNS($C$183:C183),$C$182,\"\")","v":"2023-10-01"},{"$f":"IF(C184<>\"\",C184+1,IF(WEEKDAY($C182)=COLUMNS($C183:D183),$C182,\"\"))","v":"2023-10-02"},{"$f":"IF(D184<>\"\",D184+1,IF(WEEKDAY($C182)=COLUMNS($C183:E183),$C182,\"\"))","v":"2023-10-03"},{"$f":"IF(E184<>\"\",E184+1,IF(WEEKDAY($C182)=COLUMNS($C183:F183),$C182,\"\"))","v":"2023-10-04"},{"$f":"IF(F184<>\"\",F184+1,IF(WEEKDAY($C182)=COLUMNS($C183:G183),$C182,\"\"))","v":"2023-10-05"},{"$f":"IF(G184<>\"\",G184+1,IF(WEEKDAY($C182)=COLUMNS($C183:H183),$C182,\"\"))","v":"2023-10-06"},{"$f":"IF(H184<>\"\",H184+1,IF(WEEKDAY($C182)=COLUMNS($C183:I183),$C182,\"\"))","v":"2023-10-07"}]
[null,null,{"$f":"IF(C184<>\"\",myvlookup(C184,Activities,2),\"\")","v":{"$error":"#NAME?"}},{"$f":"IF(D184<>\"\",myvlookup(D184,Activities,2),\"\")","v":{"$error":"#NAME?"}},{"$f":"IF(E184<>\"\",myvlookup(E184,Activities,2),\"\")","v":{"$error":"#NAME?"}},{"$f":"IF(F184<>\"\",myvlookup(F184,Activities,2),\"\")","v":{"$error":"#NAME?"}},{"$f":"IF(G184<>\"\",myvlookup(G184,Activities,2),\"\")","v":{"$error":"#NAME?"}},{"$f":"IF(H184<>\"\",myvlookup(H184,Activities,2),\"\")","v":{"$error":"#NAME?"}},{"$f":"IF(I184<>\"\",myvlookup(I184,Activities,2),\"\")","v":{"$error":"#NAME?"}}]
[null,null,{"$f":"IF(I184<>\"\",I184+1,IF(WEEKDAY($C$5)=COLUMNS($C$6:I183),$C$5,\"\"))","v":"2023-10-08"},{"$f":"(C186+1)","v":"2023-10-09"},{"$f":"D186+1","v":"2023-10-10"},{"$f":"E186+1","v":"2023-10-11"},{"$f":"F186+1","v":"2023-10-12"},{"$f":"G186+1","v":"2023-10-13"},{"$f":"H186+1","v":"2023-10-14"}]
[null,null,{"$f":"myvlookup(C186,Activities,2)","v":{"$error":"#NAME?"}},{"$f":"myvlookup(D186,Activities,2)","v":{"$error":"#NAME?"}},{"$f":"myvlookup(E186,Activities,2)","v":{"$error":"#NAME?"}},{"$f":"myvlookup(F186,Activities,2)","v":{"$error":"#NAME?"}},{"$f":"myvlookup(G186,Activities,2)","v":{"$error":"#NAME?"}},{"$f":"myvlookup(H186,Activities,2)","v":{"$error":"#NAME?"}},{"$f":"myvlookup(I186,Activities,2)","v":{"$error":"#NAME?"}}]
[null,null,{"$f":"IF(I186<>\"\",I186+1,IF(WEEKDAY($C$5)=COLUMNS($C$6:I183),$C$5,\"\"))","v":"2023-10-15"},{"$f":"C188+1","v":"2023-10-16"},"2023-10-17","2023-10-18","2023-10-19","2023-10-20","2023-10-21"]
[null,null,{"$f":"myvlookup(C188,Activities,2)","v":{"$error":"#NAME?"}},{"$f":"myvlookup(D188,Activities,2)","v":{"$error":"#NAME?"}},{"$f":"myvlookup(E188,Activities,2)","v":{"$error":"#NAME?"}},{"$f":"myvlookup(F188,Activities,2)","v":{"$error":"#NAME?"}},{"$f":"myvlookup(G188,Activities,2)","v":{"$error":"#NAME?"}},{"$f":"myvlookup(H188,Activities,2)","v":{"$error":"#NAME?"}},{"$f":"myvlookup(I188,Activities,2)","v":{"$error":"#NAME?"}}]
[null,null,{"$f":"I188+1","v":"2023-10-22"},{"$f":"C190+1","v":"2023-10-23"},"2023-10-24","2023-10-25","2023-10-26","2023-10-27","2023-10-28"]
[null,null,{"$f":"myvlookup(C190,Activities,2)","v":{"$error":"#NAME?"}},{"$f":"myvlookup(D190,Activities,2)","v":{"$error":"#NAME?"}},{"$f":"myvlookup(E190,Activities,2)","v":{"$error":"#NAME?"}},{"$f":"myvlookup(F190,Activities,2)","v":{"$error":"#NAME?"}},{"$f":"myvlookup(G190,Activities,2)","v":{"$error":"#NAME?"}},{"$f":"myvlookup(H190,Activities,2)","v":{"$error":"#NAME?"}},{"$f":"myvlookup(I190,Activities,2)","v":{"$error":"#NAME?"}}]
[null,null,{"$f":"IF(I190<>\"\",I190+1,IF(WEEKDAY($C$5)=COLUMNS($C$6:I183),$C$5,\"\"))","v":"2023-10-29"},{"$f":"C192+1","v":"2023-10-30"},"2023-10-31","2023-11-01","2023-11-02","2023-11-03","2023-11-04"]
[null,null,{"$f":"myvlookup(C192,Activities,2)","v":{"$error":"#NAME?"}},{"$f":"myvlookup(D192,Activities,2)","v":{"$error":"#NAME?"}},{"$f":"myvlookup(E192,Activities,2)","v":{"$error":"#NAME?"}},{"$f":"myvlookup(F192,Activities,2)","v":{"$error":"#NAME?"}},{"$f":"myvlookup(G192,Activities,2)","v":{"$error":"#NAME?"}},{"$f":"myvlookup(H192,Activities,2)","v":{"$error":"#NAME?"}},{"$f":"myvlookup(I192,Activities,2)","v":{"$error":"#NAME?"}}]
[null,null,{"$f":"IF(I192<>\"\",I192+1,IF(WEEKDAY($C$5)=COLUMNS($C$6:I185),$C$5,\"\"))","v":"2023-11-05"},{"$f":"C194+1","v":"2023-11-06"},{"$f":"D194+1","v":"2023-11-07"},{"$f":"E194+1","v":"2023-11-08"},{"$f":"F194+1","v":"2023-11-09"},{"$f":"G194+1","v":"2023-11-10"},{"$f":"H194+1","v":"2023-11-11"}]
[null,null,{"$f":"myvlookup(C194,Activities,2)","v":{"$error":"#NAME?"}},{"$f":"myvlookup(D194,Activities,2)","v":{"$error":"#NAME?"}},{"$f":"myvlookup(E194,Activities,2)","v":{"$error":"#NAME?"}},{"$f":"myvlookup(F194,Activities,2)","v":{"$error":"#NAME?"}},{"$f":"myvlookup(G194,Activities,2)","v":{"$error":"#NAME?"}},{"$f":"myvlookup(H194,Activities,2)","v":{"$error":"#NAME?"}},{"$f":"myvlookup(I194,Activities,2)","v":{"$error":"#NAME?"}}]
[]
[2,{"$f":"INDEX('Activity List'!L:L,'Activity List'!$A$1+11)","v":"November"}]
[2,{"$f":"IF($B181=\"December\",$B182+1,$B182)","v":2023},{"$f":"DATEVALUE(\"1-\"&B197&\"-\"&B198)","v":"2023-11-01"}]
[null,null,"Sun","Mon","Tue","Wed","Thu","Fri","Sat"]
[null,null,{"$f":"IF(WEEKDAY($C$198)=COLUMNS($C$199:C199),$C$198,\"\")","v":""},{"$f":"IF(C200<>\"\",C200+1,IF(WEEKDAY($C198)=COLUMNS($C199:D199),$C198,\"\"))","v":""},{"$f":"IF(D200<>\"\",D200+1,IF(WEEKDAY($C198)=COLUMNS($C199:E199),$C198,\"\"))","v":""},{"$f":"IF(E200<>\"\",E200+1,IF(WEEKDAY($C198)=COLUMNS($C199:F199),$C198,\"\"))","v":"2023-11-01"},{"$f":"IF(F200<>\"\",F200+1,IF(WEEKDAY($C198)=COLUMNS($C199:G199),$C198,\"\"))","v":"2023-11-02"},{"$f":"IF(G200<>\"\",G200+1,IF(WEEKDAY($C198)=COLUMNS($C199:H199),$C198,\"\"))","v":"2023-11-03"},{"$f":"IF(H200<>\"\",H200+1,IF(WEEKDAY($C198)=COLUMNS($C199:I199),$C198,\"\"))","v":"2023-11-04"}]
[null,null,{"$f":"IF(C200<>\"\",myvlookup(C200,Activities,2),\"\")","v":""},{"$f":"IF(D200<>\"\",myvlookup(D200,Activities,2),\"\")","v":""},{"$f":"IF(E200<>\"\",myvlookup(E200,Activities,2),\"\")","v":""},{"$f":"IF(F200<>\"\",myvlookup(F200,Activities,2),\"\")","v":{"$error":"#NAME?"}},{"$f":"IF(G200<>\"\",myvlookup(G200,Activities,2),\"\")","v":{"$error":"#NAME?"}},{"$f":"IF(H200<>\"\",myvlookup(H200,Activities,2),\"\")","v":{"$error":"#NAME?"}},{"$f":"IF(I200<>\"\",myvlookup(I200,Activities,2),\"\")","v":{"$error":"#NAME?"}}]
[null,null,{"$f":"IF(I200<>\"\",I200+1,IF(WEEKDAY($C$5)=COLUMNS($C$6:I199),$C$5,\"\"))","v":"2023-11-05"},{"$f":"(C202+1)","v":"2023-11-06"},{"$f":"D202+1","v":"2023-11-07"},{"$f":"E202+1","v":"2023-11-08"},{"$f":"F202+1","v":"2023-11-09"},{"$f":"G202+1","v":"2023-11-10"},{"$f":"H202+1","v":"2023-11-11"}]
[null,null,{"$f":"myvlookup(C202,Activities,2)","v":{"$error":"#NAME?"}},{"$f":"myvlookup(D202,Activities,2)","v":{"$error":"#NAME?"}},{"$f":"myvlookup(E202,Activities,2)","v":{"$error":"#NAME?"}},{"$f":"myvlookup(F202,Activities,2)","v":{"$error":"#NAME?"}},{"$f":"myvlookup(G202,Activities,2)","v":{"$error":"#NAME?"}},{"$f":"myvlookup(H202,Activities,2)","v":{"$error":"#NAME?"}},{"$f":"myvlookup(I202,Activities,2)","v":{"$error":"#NAME?"}}]
[null,null,{"$f":"IF(I202<>\"\",I202+1,IF(WEEKDAY($C$5)=COLUMNS($C$6:I199),$C$5,\"\"))","v":"2023-11-12"},{"$f":"C204+1","v":"2023-11-13"},"2023-11-14","2023-11-15","2023-11-16","2023-11-17","2023-11-18"]
[null,null,{"$f":"myvlookup(C204,Activities,2)","v":{"$error":"#NAME?"}},{"$f":"myvlookup(D204,Activities,2)","v":{"$error":"#NAME?"}},{"$f":"myvlookup(E204,Activities,2)","v":{"$error":"#NAME?"}},{"$f":"myvlookup(F204,Activities,2)","v":{"$error":"#NAME?"}},{"$f":"myvlookup(G204,Activities,2)","v":{"$error":"#NAME?"}},{"$f":"myvlookup(H204,Activities,2)","v":{"$error":"#NAME?"}},{"$f":"myvlookup(I204,Activities,2)","v":{"$error":"#NAME?"}}]
[null,null,{"$f":"I204+1","v":"2023-11-19"},{"$f":"C206+1","v":"2023-11-20"},"2023-11-21","2023-11-22","2023-11-23","2023-11-24","2023-11-25"]
[null,null,{"$f":"myvlookup(C206,Activities,2)","v":{"$error":"#NAME?"}},{"$f":"myvlookup(D206,Activities,2)","v":{"$error":"#NAME?"}},{"$f":"myvlookup(E206,Activities,2)","v":{"$error":"#NAME?"}},{"$f":"myvlookup(F206,Activities,2)","v":{"$error":"#NAME?"}},{"$f":"myvlookup(G206,Activities,2)","v":{"$error":"#NAME?"}},{"$f":"myvlookup(H206,Activities,2)","v":{"$error":"#NAME?"}},{"$f":"myvlookup(I206,Activities,2)","v":{"$error":"#NAME?"}}]
[null,null,{"$f":"IF(I206<>\"\",I206+1,IF(WEEKDAY($C$5)=COLUMNS($C$6:I199),$C$5,\"\"))","v":"2023-11-26"},{"$f":"C208+1","v":"2023-11-27"},"2023-11-28","2023-11-29","2023-11-30","2023-12-01","2023-12-02"]
[null,null,{"$f":"IF(MONTH(C208)=MONTH($C198),myvlookup(C208,Activities,2),\"\")","v":{"$error":"#NAME?"}},{"$f":"IF(MONTH(D208)=MONTH($C198),myvlookup(D208,Activities,2),\"\")","v":{"$error":"#NAME?"}},{"$f":"IF(MONTH(E208)=MONTH($C198),myvlookup(E208,Activities,2),\"\")","v":{"$error":"#NAME?"}},{"$f":"IF(MONTH(F208)=MONTH($C198),myvlookup(F208,Activities,2),\"\")","v":{"$error":"#NAME?"}},{"$f":"IF(MONTH(G208)=MONTH($C198),myvlookup(G208,Activities,2),\"\")","v":{"$error":"#NAME?"}},{"$f":"IF(MONTH(H208)=MONTH($C198),myvlookup(H208,Activities,2),\"\")","v":""},{"$f":"IF(MONTH(I208)=MONTH($C198),myvlookup(I208,Activities,2),\"\")","v":""}]
[null,null,{"$f":"IF(I208<>\"\",I208+1,IF(WEEKDAY($C$5)=COLUMNS($C$5:I200),$C$5,\"\"))","v":"2023-12-03"},{"$f":"C210+1","v":"2023-12-04"},"2023-12-05","2023-12-06","2023-12-07","2023-12-08","2023-12-09"]
[null,null,{"$f":"IF(MONTH(C210)=MONTH($C198),myvlookup(C210,Activities,2),\"\")","v":""},{"$f":"IF(MONTH(D210)=MONTH($C198),myvlookup(D210,Activities,2),\"\")","v":""},{"$f":"IF(MONTH(E210)=MONTH($C198),myvlookup(E210,Activities,2),\"\")","v":""},{"$f":"IF(MONTH(F210)=MONTH($C198),myvlookup(F210,Activities,2),\"\")","v":""},{"$f":"IF(MONTH(G210)=MONTH($C198),myvlookup(G210,Activities,2),\"\")","v":""},{"$f":"IF(MONTH(H210)=MONTH($C198),myvlookup(H210,Activities,2),\"\")","v":""},{"$f":"IF(MONTH(I210)=MONTH($C198),myvlookup(I210,Activities,2),\"\")","v":""}]