{"text_format":"1","workbook":"xlsx","n_sheets":3,"sheets":["Instructions for Use","Activity List","Calendar"],"not_rendered":{"charts":0,"images":7,"macros":1,"external_links":0,"defined_names":10,"comments":2,"pivot_tables":0},"unopened":[],"bounds":{"document_bytes":16777216,"sheet_cells":100000,"rows_first":2000,"rows_last":500,"rows_between":2000,"halvings":0,"cell_chars":16384,"cell_head_chars":4096},"cells_cut":0,"cells_raw":0,"read":"whole","date_system":"1900"}

{"sheet":"Instructions for Use","index":0,"n_rows":25,"n_cols":1,"rows_kept":25,"cut":false,"hidden":false,"merged":[]}
["  Instructions for Using \n  Annual Planning Calendar for Program Management:\n  A Customizable Roadmap for Program and Fiscal Leaders"]
["Head Start five-year grants require the development of data-informed goals and objectives as well as a mechanism for continuous improvement. Through the Head Start leadership model, the governing body, Policy Council, and program’s management team must collaborate to develop a system of planning and oversight that will achieve progress toward their goals and ensure quality services for children and families. \n\nThe following calendar outlines the requirements for programs in the area of planning, including the development and implementation of oversight systems, which are critical to planning for continuous improvement. Head Start programs operate with differing fiscal years and  program calendars. The attached calendar outlines the planning requirements so that programs can identify the required planning activity and determine how it fits into their operational calendar. The activity list includes the leadership and administrative functions and requirements of the grant development and oversight process. Additional program area activities can be added. Use this customizable roadmap to identify required planning activities and foster meaningful collaboration with program and fiscal leaders. This practical Microsoft Excel-based calendar is compliant, comprehensive, and customizable."]
["How to Use the Annual Planning Calendar for Program Management"]
["1) Start with the \"Activity List\" sheet at the bottom of the page. "]
["2) Select the month and year that you want to start planning."]
["3) In the date column, enter the date when the activity will be completed."]
["4) If the events are recurring, enter them manually in the calendar page."]
["5) Dates will be automatically populated into the calendar view."]
["6) When all the activities have been assigned a date, go to the \"Calendar\" sheet at the bottom of the page to view  the dates in a calendar view. "]
["7)  Cells may need to be adjusted in order to show all of the text. To do so, adjust the size of the row by dragging the boundary below the numbered row. You may also select the cell and find \"Wrap Text\" in the ribbon above. "]
["8) The calendar may be printed or kept for reference."]
["9) To access control boxes using a keyboard, navigate to the cell and press alt and the down arrow. Use the up and down arrows to navigate the menu, then press enter to make your selection."]
["Adding activites: "]
["1) Use the \"Additional Items\" box."]
["2) If you run out of rows, right-click an existing entry and select \"Insert.\""]
["3) Select \"Entire Row.\""]
["4) Add activity."]
["Note: Some timeframes or activities have notes with helpful information. They have an indicator in the top right corner of the cell. See the example below."]
["Example"]
["Hover your mouse over that cell to reveal the note, or right-click and select \"Show/Hide Notes.\"\nYou can show all the notes by navigating to the top of the page and selecting \"Review\" and \"Show All Notes.\" For screen reader users, select a cell with a note and press Shift and F2 for the notes window."]
["Program Planning Resources"]
["Foundations for Excellence: A Guide for Five-Year Planning and Continuous Improvement 2nd Edition"]
["Self-Assessment: Your Annual Journey"]
["Community Assessment: The Foundation for Program Planning "]
["End of Instructions for Use"]

{"sheet":"Activity List","index":1,"n_rows":145,"n_cols":14,"rows_kept":145,"cut":false,"hidden":false,"merged":[]}
[{"$f":"MONTH(DATEVALUE(B1&\"1\"))","v":12},{"$f":"E4","v":"December"},null,null,"Annual Planning Calendar for Program Management: A Customizable Roadmap for Program and Fiscal Leaders",null,null,null,null,"Start",null,"January",1,2017]
[null,null,"Program Name: Your Program Name Here",null,null,null,null,null,null,"Pending",null,"February",2,2018]
[null,{"$f":"E5","v":2022},null,"Set your calendar start below:",null,null,null,null,null,"Done",null,"March",3,2019]
[null,null,null,"Month","December","Enter Project Month start here",null,null,null,null,null,"April",4,2020]
[null,null,null,"Year",2022,"Enter Project Year here",null,null,null,null,null,"May",5,2021]
[null,null,"  Prior to the Five-Year Project Period",null,null,null,null,null,null,null,null,"June",6,2022]
[null,null,"Progress","Date to be completed","Activity","Citation",null,null,null,null,null,"July",7,2023]
[null,null,null,null,"Conduct a communitywide strategic planning and needs assessment to design a program that meets community needs.","1302.11(b) ",null,null,null,null,null,"August",8,2024]
[null,null,null,null,"Ensure appropriate governance structure (e.g., governing body, Tribal Council, Policy Council) and bylaws are in place.","Sec. 642(c) ",null,null,null,null,null,"September",9,2025]
[null,null,null,null,"Establish Policy Council selection procedures. ","Sec. 642(c)(1)(E)(iv)(VI)",null,null,null,null,null,"October",10,2026]
[null,null,null,null,"Develop strategic long-term goals to ensure responsive program services.","1302.102(a) ",null,null,null,null,null,"November",11,2027]
[null,null,null,null,null,null,null,null,null,null,null,"December",12,2028]
[null,null,"  Start of Project Period",null,null,null,null,null,null,null,null,"January",null,2029]
[null,null,"Progress","Date to be completed","Activity","Citation",null,null,null,null,null,"February",null,2030]
[null,null,null,null,"Complete Governance, Leadership, and Oversight Capacity Screener and training plan.",null,null,null,null,null,null,"March",null,2031]
[null,null,null,null,"Begin implementation of action plans for five-year goals and objectives.","1302.102(b)(2)",null,null,null,null,null,"April",null,2032]
[null,null,null,null,"Begin monitoring identified data for progress on goals and compliance with the Head Start Program Performance Standards (the Performance Standards). ","1302.102(b)",null,null,null,null,null,"May",null,2033]
[null,null,null,null,"Design and implement coordinated approaches.","1302.101(b)",null,null,null,null,null,"June",null,2034]
[null,null,null,null,"Begin implementation of the governing body/Tribal Council and Policy Council orientation and training plan.  ",1301.5,null,null,null,null,null,"July",null,2035]
[null,null,null,null,"Support the governing body/Tribal Council in establishing procedures and guidelines for accessing and collecting information. ","Sec. 642(c)(1)(E)(iv)(IV) ",null,null,null,null,null,"August",null,2036]
[null,null,null,null,null,null,null,null,null,null,null,"September",null,2037]
[null,null,"  Annually at the Beginning of the Program Year",null,null,null,null,null,null,null,null,"October",null,2038]
[null,null,"Progress","Date to be completed","Activity","Citation",null,null,null,null,null,"November",null,2039]
[null,null,null,null,"Establish the Policy Council.","1301.3(a)",null,null,null,null,null,"December",null,2040]
[null,null,null,null,"Begin or continue implementation of action plans for five-year goals and objectives, including any modified or added goals or objectives. ","1302.102(b)(1)",null,null,null,null,null,"January",null,2041]
[null,null,null,null,"Begin or continue monitoring identified data for progress on goals, including any modified or added goals or objectives, and compliance with the Performance Standards. ","1302.102(c)(1)",null,null,null,null,null,"February",null,2042]
[null,null,null,null,null,null,null,null,null,null,null,"March",null,2043]
[null,null,"  Monthly",null,null,null,null,null,null,null,null,"April",null,2044]
[null,null,"Progress","Date to be completed","Activity","Citation",null,null,null,null,null,"May",null,2045]
[null,null,null,null,"Provide monthly reports so that the governing body/Tribal council and the Policy Council have accurate and regular information about program planning, policies, and Head Start agency operations.","Sec. 642(d)(2), ",null,null,null,null,null,"June",null,2046]
[null,null,null,null,null,"1301.2(b)(2)",null,null,null,null,null,"July"]
[null,null,null,null,null,"1301.3(c)(2)",null,null,null,null,null,"August"]
[null,null,null,null,null,"1302.102(b)",null,null,null,null,null,"September"]
[null,null,null,null,"Report enrollment in the HSES","Sec.641A(h)(2)"]
[null,null,"  Quarterly"]
[null,null,"Progress","Date to be completed","Activity","Citation"]
[null,null,null,null,"Submit Federal Financial Report (SF-425) detailing cash transactions made for federal award(s) and separate reports detailing expenditures made for the same award(s).","ACF-PI-HS-17-04"]
[null,null,"  Semi-Annually "]
[null,null,"Progress","Date to be completed","Activity","Citation"]
[null,null,null,null,"Submit semiannual Federal Financial Report (SF-425). ","ACF-PI-HS-17-04"]
{"$rows_left_out":106}
{"sheet":"Calendar","index":2,"n_rows":211,"n_cols":9,"rows_kept":211,"cut":false,"hidden":false,"merged":[]}
[null,null,null,"  Annual Planning Calendar for Program Management:"]
[2,{"$f":"INDEX('Activity List'!L:L,'Activity List'!A1)","v":"December"},null,"  A Customizable Roadmap for Program and Fiscal Leaders"]
[null,null,{"$f":"'Activity List'!C2","v":"Program Name: Your Program Name Here"}]
[2,{"$f":"'Activity List'!B3","v":2022}]
[null,null,{"$f":"DATEVALUE(\"1-\"&'Activity List'!B1&\"-\"&'Activity List'!B3)","v":"2022-12-01"}]
[null,null,"Sun","Mon","Tue","Wed","Thu","Fri","Sat"]
[null,null,{"$f":"IF(WEEKDAY($C$5)=COLUMNS($C$6:C6),$C$5,\"\")","v":""},{"$f":"IF(C7<>\"\",C7+1,IF(WEEKDAY($C$5)=COLUMNS($C$6:D6),$C$5,\"\"))","v":""},{"$f":"IF(D7<>\"\",D7+1,IF(WEEKDAY($C$5)=COLUMNS($C$6:E6),$C$5,\"\"))","v":""},{"$f":"IF(E7<>\"\",E7+1,IF(WEEKDAY($C$5)=COLUMNS($C$6:F6),$C$5,\"\"))","v":""},{"$f":"IF(F7<>\"\",F7+1,IF(WEEKDAY($C$5)=COLUMNS($C$6:G6),$C$5,\"\"))","v":"2022-12-01"},{"$f":"IF(G7<>\"\",G7+1,IF(WEEKDAY($C$5)=COLUMNS($C$6:H6),$C$5,\"\"))","v":"2022-12-02"},{"$f":"IF(H7<>\"\",H7+1,IF(WEEKDAY($C$5)=COLUMNS($C$6:I6),$C$5,\"\"))","v":"2022-12-03"}]
[null,null,{"$f":"IF(C$7<>\"\",myvlookup(C7,Activities,2),\"\")","v":""},{"$f":"IF(D$7<>\"\",myvlookup(D7,Activities,2),\"\")","v":""},{"$f":"IF(E$7<>\"\",myvlookup(E7,Activities,2),\"\")","v":""},{"$f":"IF(F$7<>\"\",myvlookup(F7,Activities,2),\"\")","v":""},{"$f":"IF(G$7<>\"\",myvlookup(G7,Activities,2),\"\")","v":{"$error":"#NAME?"}},{"$f":"IF(H$7<>\"\",myvlookup(H7,Activities,2),\"\")","v":{"$error":"#NAME?"}},{"$f":"IF(I$7<>\"\",myvlookup(I7,Activities,2),\"\")","v":{"$error":"#NAME?"}}]
[null,null,{"$f":"IF(I7<>\"\",I7+1,IF(WEEKDAY($C$5)=COLUMNS($C$6:I6),$C$5,\"\"))","v":"2022-12-04"},{"$f":"(C9+1)","v":"2022-12-05"},{"$f":"D9+1","v":"2022-12-06"},{"$f":"E9+1","v":"2022-12-07"},{"$f":"F9+1","v":"2022-12-08"},{"$f":"G9+1","v":"2022-12-09"},{"$f":"H9+1","v":"2022-12-10"}]
[null,null,{"$f":"myvlookup(C9,Activities,2)","v":{"$error":"#NAME?"}},{"$f":"myvlookup(D9,Activities,2)","v":{"$error":"#NAME?"}},{"$f":"myvlookup(E9,Activities,2)","v":{"$error":"#NAME?"}},{"$f":"myvlookup(F9,Activities,2)","v":{"$error":"#NAME?"}},{"$f":"myvlookup(G9,Activities,2)","v":{"$error":"#NAME?"}},{"$f":"myvlookup(H9,Activities,2)","v":{"$error":"#NAME?"}},{"$f":"myvlookup(I9,Activities,2)","v":{"$error":"#NAME?"}}]
[null,null,{"$f":"IF(I9<>\"\",I9+1,IF(WEEKDAY($C$5)=COLUMNS($C$6:I6),$C$5,\"\"))","v":"2022-12-11"},{"$f":"C11+1","v":"2022-12-12"},"2022-12-13","2022-12-14","2022-12-15","2022-12-16","2022-12-17"]
[null,null,{"$f":"myvlookup(C11,Activities,2)","v":{"$error":"#NAME?"}},{"$f":"myvlookup(D11,Activities,2)","v":{"$error":"#NAME?"}},{"$f":"myvlookup(E11,Activities,2)","v":{"$error":"#NAME?"}},{"$f":"myvlookup(F11,Activities,2)","v":{"$error":"#NAME?"}},{"$f":"myvlookup(G11,Activities,2)","v":{"$error":"#NAME?"}},{"$f":"myvlookup(H11,Activities,2)","v":{"$error":"#NAME?"}},{"$f":"myvlookup(I11,Activities,2)","v":{"$error":"#NAME?"}}]
[null,null,{"$f":"I11+1","v":"2022-12-18"},{"$f":"C13+1","v":"2022-12-19"},"2022-12-20","2022-12-21","2022-12-22","2022-12-23","2022-12-24"]
[null,null,{"$f":"myvlookup(C13,Activities,2)","v":{"$error":"#NAME?"}},{"$f":"myvlookup(D13,Activities,2)","v":{"$error":"#NAME?"}},{"$f":"myvlookup(E13,Activities,2)","v":{"$error":"#NAME?"}},{"$f":"myvlookup(F13,Activities,2)","v":{"$error":"#NAME?"}},{"$f":"myvlookup(G13,Activities,2)","v":{"$error":"#NAME?"}},{"$f":"myvlookup(H13,Activities,2)","v":{"$error":"#NAME?"}},{"$f":"myvlookup(I13,Activities,2)","v":{"$error":"#NAME?"}}]
[null,null,{"$f":"IF(I13<>\"\",I13+1,IF(WEEKDAY($C$5)=COLUMNS($C$6:I6),$C$5,\"\"))","v":"2022-12-25"},{"$f":"C15+1","v":"2022-12-26"},"2022-12-27","2022-12-28","2022-12-29","2022-12-30","2022-12-31"]
[null,null,{"$f":"myvlookup(C15,Activities,2)","v":{"$error":"#NAME?"}},{"$f":"myvlookup(D15,Activities,2)","v":{"$error":"#NAME?"}},{"$f":"myvlookup(E15,Activities,2)","v":{"$error":"#NAME?"}},{"$f":"myvlookup(F15,Activities,2)","v":{"$error":"#NAME?"}},{"$f":"myvlookup(G15,Activities,2)","v":{"$error":"#NAME?"}},{"$f":"myvlookup(H15,Activities,2)","v":{"$error":"#NAME?"}},{"$f":"myvlookup(I15,Activities,2)","v":{"$error":"#NAME?"}}]
[null,null,{"$f":"IF(I15<>\"\",I15+1,IF(WEEKDAY($C$5)=COLUMNS($C$5:I7),$C$5,\"\"))","v":"2023-01-01"},{"$f":"C17+1","v":"2023-01-02"},"2023-01-03","2023-01-04","2023-01-05","2023-01-06","2023-01-07"]
[null,null,{"$f":"myvlookup(C17,Activities,2)","v":{"$error":"#NAME?"}},{"$f":"myvlookup(D17,Activities,2)","v":{"$error":"#NAME?"}},{"$f":"myvlookup(E17,Activities,2)","v":{"$error":"#NAME?"}},{"$f":"myvlookup(F17,Activities,2)","v":{"$error":"#NAME?"}},{"$f":"myvlookup(G17,Activities,2)","v":{"$error":"#NAME?"}},{"$f":"myvlookup(H17,Activities,2)","v":{"$error":"#NAME?"}},{"$f":"myvlookup(I17,Activities,2)","v":{"$error":"#NAME?"}}]
[]
[2,{"$f":"INDEX('Activity List'!L:L,'Activity List'!$A$1+1)","v":"January"}]
[2,{"$f":"IF(B2=\"December\",B4+1,B4)","v":2023},{"$f":"DATEVALUE(\"1-\"&B20&\"-\"&B21)","v":"2023-01-01"}]
[null,null,"Sun","Mon","Tue","Wed","Thu","Fri","Sat"]
[null,null,{"$f":"IF(WEEKDAY($C$21)=COLUMNS($C$22:C22),$C$21,\"\")","v":"2023-01-01"},{"$f":"IF(C23<>\"\",C23+1,IF(WEEKDAY($C$21)=COLUMNS($C$22:D22),$C$21,\"\"))","v":"2023-01-02"},{"$f":"IF(D23<>\"\",D23+1,IF(WEEKDAY($C$21)=COLUMNS($C$22:E22),$C$21,\"\"))","v":"2023-01-03"},{"$f":"IF(E23<>\"\",E23+1,IF(WEEKDAY($C$21)=COLUMNS($C$22:F22),$C$21,\"\"))","v":"2023-01-04"},{"$f":"IF(F23<>\"\",F23+1,IF(WEEKDAY($C$21)=COLUMNS($C$22:G22),$C$21,\"\"))","v":"2023-01-05"},{"$f":"IF(G23<>\"\",G23+1,IF(WEEKDAY($C$21)=COLUMNS($C$22:H22),$C$21,\"\"))","v":"2023-01-06"},{"$f":"IF(H23<>\"\",H23+1,IF(WEEKDAY($C$21)=COLUMNS($C$22:I22),$C$21,\"\"))","v":"2023-01-07"}]
[null,null,{"$f":"IF(C$23<>\"\",myvlookup(C23,Activities,2),\"\")","v":{"$error":"#NAME?"}},{"$f":"IF(D$23<>\"\",myvlookup(D23,Activities,2),\"\")","v":{"$error":"#NAME?"}},{"$f":"IF(E$23<>\"\",myvlookup(E23,Activities,2),\"\")","v":{"$error":"#NAME?"}},{"$f":"IF(F$23<>\"\",myvlookup(F23,Activities,2),\"\")","v":{"$error":"#NAME?"}},{"$f":"IF(G$23<>\"\",myvlookup(G23,Activities,2),\"\")","v":{"$error":"#NAME?"}},{"$f":"IF(H$23<>\"\",myvlookup(H23,Activities,2),\"\")","v":{"$error":"#NAME?"}},{"$f":"IF(I$23<>\"\",myvlookup(I23,Activities,2),\"\")","v":{"$error":"#NAME?"}}]
[null,null,{"$f":"IF(I23<>\"\",I23+1,IF(WEEKDAY($C$5)=COLUMNS($C$6:I22),$C$5,\"\"))","v":"2023-01-08"},{"$f":"(C25+1)","v":"2023-01-09"},{"$f":"D25+1","v":"2023-01-10"},{"$f":"E25+1","v":"2023-01-11"},{"$f":"F25+1","v":"2023-01-12"},{"$f":"G25+1","v":"2023-01-13"},{"$f":"H25+1","v":"2023-01-14"}]
[null,null,{"$f":"myvlookup(C25,Activities,2)","v":{"$error":"#NAME?"}},{"$f":"myvlookup(D25,Activities,2)","v":{"$error":"#NAME?"}},{"$f":"myvlookup(E25,Activities,2)","v":{"$error":"#NAME?"}},{"$f":"myvlookup(F25,Activities,2)","v":{"$error":"#NAME?"}},{"$f":"myvlookup(G25,Activities,2)","v":{"$error":"#NAME?"}},{"$f":"myvlookup(H25,Activities,2)","v":{"$error":"#NAME?"}},{"$f":"myvlookup(I25,Activities,2)","v":{"$error":"#NAME?"}}]
[null,null,{"$f":"IF(I25<>\"\",I25+1,IF(WEEKDAY($C$5)=COLUMNS($C$6:I22),$C$5,\"\"))","v":"2023-01-15"},{"$f":"C27+1","v":"2023-01-16"},"2023-01-17","2023-01-18","2023-01-19","2023-01-20","2023-01-21"]
[null,null,{"$f":"myvlookup(C27,Activities,2)","v":{"$error":"#NAME?"}},{"$f":"myvlookup(D27,Activities,2)","v":{"$error":"#NAME?"}},{"$f":"myvlookup(E27,Activities,2)","v":{"$error":"#NAME?"}},{"$f":"myvlookup(F27,Activities,2)","v":{"$error":"#NAME?"}},{"$f":"myvlookup(G27,Activities,2)","v":{"$error":"#NAME?"}},{"$f":"myvlookup(H27,Activities,2)","v":{"$error":"#NAME?"}},{"$f":"myvlookup(I27,Activities,2)","v":{"$error":"#NAME?"}}]
[null,null,{"$f":"I27+1","v":"2023-01-22"},{"$f":"C29+1","v":"2023-01-23"},"2023-01-24","2023-01-25","2023-01-26","2023-01-27","2023-01-28"]
[null,null,{"$f":"myvlookup(C29,Activities,2)","v":{"$error":"#NAME?"}},{"$f":"myvlookup(D29,Activities,2)","v":{"$error":"#NAME?"}},{"$f":"myvlookup(E29,Activities,2)","v":{"$error":"#NAME?"}},{"$f":"myvlookup(F29,Activities,2)","v":{"$error":"#NAME?"}},{"$f":"myvlookup(G29,Activities,2)","v":{"$error":"#NAME?"}},{"$f":"myvlookup(H29,Activities,2)","v":{"$error":"#NAME?"}},{"$f":"myvlookup(I29,Activities,2)","v":{"$error":"#NAME?"}}]
[null,null,{"$f":"IF(I29<>\"\",I29+1,IF(WEEKDAY($C$5)=COLUMNS($C$6:I22),$C$5,\"\"))","v":"2023-01-29"},{"$f":"C31+1","v":"2023-01-30"},"2023-01-31","2023-02-01","2023-02-02","2023-02-03","2023-02-04"]
[null,null,{"$f":"IF(MONTH(C$31)=MONTH($C$21),myvlookup(C31,Activities,2),\"\")","v":{"$error":"#NAME?"}},{"$f":"IF(MONTH(D$31)=MONTH($C$21),myvlookup(D31,Activities,2),\"\")","v":{"$error":"#NAME?"}},{"$f":"IF(MONTH(E$31)=MONTH($C$21),myvlookup(E31,Activities,2),\"\")","v":{"$error":"#NAME?"}},{"$f":"IF(MONTH(F$31)=MONTH($C$21),myvlookup(F31,Activities,2),\"\")","v":""},{"$f":"IF(MONTH(G$31)=MONTH($C$21),myvlookup(G31,Activities,2),\"\")","v":""},{"$f":"IF(MONTH(H$31)=MONTH($C$21),myvlookup(H31,Activities,2),\"\")","v":""},{"$f":"IF(MONTH(I$31)=MONTH($C$21),myvlookup(I31,Activities,2),\"\")","v":""}]
[null,null,{"$f":"IF(I31<>\"\",I31+1,IF(WEEKDAY($C$5)=COLUMNS($C$5:I23),$C$5,\"\"))","v":"2023-02-05"},{"$f":"C33+1","v":"2023-02-06"},"2023-02-07","2023-02-08","2023-02-09","2023-02-10","2023-02-11"]
[null,null,{"$f":"IF(MONTH(C$33)=MONTH($C$21),myvlookup(C33,Activities,2),\"\")","v":""},{"$f":"IF(MONTH(D$33)=MONTH($C$21),myvlookup(D33,Activities,2),\"\")","v":""},{"$f":"IF(MONTH(E$33)=MONTH($C$21),myvlookup(E33,Activities,2),\"\")","v":""},{"$f":"IF(MONTH(F$33)=MONTH($C$21),myvlookup(F33,Activities,2),\"\")","v":""},{"$f":"IF(MONTH(G$33)=MONTH($C$21),myvlookup(G33,Activities,2),\"\")","v":""},{"$f":"IF(MONTH(H$33)=MONTH($C$21),myvlookup(H33,Activities,2),\"\")","v":""},{"$f":"IF(MONTH(I$33)=MONTH($C$21),myvlookup(I33,Activities,2),\"\")","v":""}]
[]
[]
[]
[2,{"$f":"INDEX('Activity List'!L:L,'Activity List'!$A$1+2)","v":"February"}]
[2,{"$f":"IF(B20=\"December\",B21+1,B21)","v":2023},{"$f":"DATEVALUE(\"1-\"&B38&\"-\"&B39)","v":"2023-02-01"}]
[null,null,"Sun","Mon","Tue","Wed","Thu","Fri","Sat"]
{"$rows_left_out":171}